program: Gaussian 09
title: 000165069
version: EM64L-G09RevD.01
frameworkgroup: C1[X(C8H12N2O4)]
method: RPBEPBE
basis: SDD
operation: Freq
keyword: #p
keyword: freq=noraman
keyword: PBEPBE/SDD
title: #p freq=noraman PBEPBE/SDD
converged: NO YES NO NO
title: Mulliken charges:
elementType: O O O O N N C C C C C C C C H H H H H H H H H H H H
charge: -0.217527 -0.215837 -0.215744 -0.217519 -0.176689 -0.176864 0.275762 0.250138 0.250234 0.275913 -0.725252 -0.758106 -0.758048 -0.725194 0.248278 0.268683 0.263165 0.277626 0.266357 0.243356 0.243331 0.277530 0.266398 0.268864 0.248206 0.262938
chargesum: 0.00000
title: Mulliken charges with hydrogens summed into heavy atoms:
elementType: O O O O N N C C C C C C C C
charge: -0.217527 -0.215837 -0.215744 -0.217519 -0.176689 -0.176864 0.275762 0.250138 0.250234 0.275913 0.054875 0.029233 0.029211 0.054814
polarizability: 1.31185598e+02 4.48622268e+00 1.03338861e+02 -5.27482602e-03 -1.84237619e-02 9.97987978e+01
1716.lowfreq: -7.4975 -0.0008 0.0003 0.0005 6.6381 12.4536 46.3927 55.2373 70.5335
frequency: 46.3900 55.1926 70.5249 74.8422 84.4257 104.2414 125.5635 172.3838 180.5325 186.3341 197.5368 198.6359 252.9496 342.9644 363.9364 386.3225 391.6024 393.2558 407.1162 442.1433 548.3341 550.4493 555.0128 565.3731 602.4912 621.2442 623.3595 634.1652 821.7995 924.6345 930.8657 967.0354 1003.3278 1032.3851 1033.1716 1036.1544 1040.1729 1042.4149 1043.2334 1145.9444 1208.1728 1217.0642 1235.7304 1265.2730 1380.9712 1385.5184 1388.8335 1389.1165 1429.5032 1429.7916 1445.5662 1445.9917 1448.9327 1449.5226 1463.7289 1467.8971 1626.9168 1637.1278 1642.5228 1645.5594 3003.5170 3004.0524 3013.4461 3013.4798 3093.1898 3093.5752 3104.1720 3104.2882 3135.2077 3135.3370 3136.6311 3136.9451
redmass: 6.5741 4.1694 4.6890 3.6268 4.3860 6.0450 4.9651 1.0524 1.0339 4.4854 1.0462 1.0555 4.6782 3.2321 3.3665 11.0274 3.3270 5.0187 5.9570 6.5962 2.8913 4.0298 2.8197 3.9946 3.9771 3.7806 3.9200 3.6193 5.0935 3.1953 3.1926 2.1950 2.0751 2.1029 1.7532 1.8057 1.7537 1.7219 2.0688 5.1058 3.6417 4.2357 5.2429 6.0953 1.2141 1.2197 1.2083 1.2150 1.0835 1.0809 1.0536 1.0499 1.0676 1.0612 1.0505 1.0486 8.0068 8.2461 9.9643 9.9022 1.0371 1.0370 1.0357 1.0357 1.0976 1.0976 1.0962 1.0962 1.1031 1.1031 1.1003 1.1002
irintensity: 1.9816 9.4385 0.9251 0.4817 7.6103 0.0025 0.3492 0.4887 0.0041 7.3145 0.3687 0.0741 12.1954 2.0590 1.9012 3.5938 2.6444 2.4531 2.9950 0.1107 1.9263 30.4802 0.2039 23.6030 15.2650 31.9901 37.6724 1.4704 0.7175 8.5695 0.4364 53.2677 85.3907 0.0145 1.6616 7.7709 13.0991 0.2965 7.8018 5.8785 291.5257 375.8721 322.2981 99.3939 79.7035 27.4947 7.8804 102.4108 48.4575 18.1400 12.1548 6.7657 23.1263 35.4566 33.6999 16.1151 83.9637 15.2740 491.2892 56.0978 2.0022 1.3752 1.7101 1.5757 4.4647 4.9512 1.8521 1.8673 14.6303 11.1703 11.7761 4.6771
temp: 298.150 k
press: 1.00000 atm
elementType: 8 8 8 8 7 7 6 6 6 6 6 6 6 6 1 1 1 1 1 1 1 1 1 1 1 1
symmnumber: 1
zpe: 519036.0 jmol-1
zpe.correction: 0.197690 hartree
zpe.thermalcorrener: 0.213532 hartree
zpe.thermalcorrenthalpy: 0.214476 hartree
zpe.thermalcorrgfe: 0.154365 hartree
zpe.sumelectzpe: -721.379730 hartree
zpe.sumelectthermal: -721.363888 hartree
zpe.sumelectthermalent: -721.362944 hartree
zpe.sumelectthermalfe: -721.423055 hartree
dipole: 0.0070 0.0104 2.3808
dipole: 2.3808
quadrupole: -87.7043 -83.5403 -83.6278
quadrupole: -7.7572 0.0031 0.0220
quadrupole: -2.7468 1.4172 1.3297 -7.7572 0.0031 0.0220
hfenergy: -721.5774202 hartree
pointgroup: C01 [X(C8H12N2O4)]
dipole: 0.0364633 -0.2833284 0.8920751 debye
dipolederiv: -0.5984446 -0.2462672 0.0861248 -0.0522541 -0.8444109 0.2638767 -0.013446 0.262814 -0.4327807 -1.0547042 -0.2126143 0.1717889 -0.0203684 -0.5614688 0.1362116 0.1074477 0.1593297 -0.3604911 -1.0782148 -0.1061635 -0.2189004 0.0143641 -0.3574539 -0.141969 -0.0547963 -0.1511968 -0.5408739 -0.6110634 -0.1774594 -0.2201437 -0.0756232 -0.4663117 -0.2833891 -0.0277824 -0.2711297 -0.7981907 -0.3731947 0.0812696 -0.0477915 -0.2208141 -1.2656542 0.4608829 0.0478334 0.5312703 -0.5238168 -0.3793032 0.0002356 0.0325353 -0.1866995 -0.5583447 -0.46724 -0.2174757 -0.5590176 -1.2243862 0.9270261 -0.2233235 0.2343118 -0.2368445 1.3974755 -0.6247907 0.216882 -0.6190076 0.5153512 1.2652872 0.3711868 -0.2881505 0.36607 1.3439913 -0.5193552 -0.3280316 -0.5160559 0.4178313 1.3277497 0.2060885 0.4225794 0.1806415 0.5590184 0.6129763 0.4521037 0.6078235 1.13977 0.8811071 0.0101617 -0.2967305 -0.0105366 0.5195471 0.6230891 -0.2901244 0.6176375 1.4391169 -0.418335 0.0331744 -0.0456626 -0.0117641 -0.0005665 -0.0201986 -0.0177878 -0.0247013 0.0322249 -0.1544709 0.2493322 -0.059095 0.1565863 -0.2775483 0.0987008 0.0013809 0.0742768 -0.029035 -0.1402501 0.1583142 0.1918875 0.1148524 -0.1054333 -0.1621046 0.0886922 -0.1443446 -0.2145721 -0.4096039 -0.0103431 0.0918514 -0.0320933 -0.0118654 -0.0061371 0.0433195 -0.004672 0.0351631 0.0675922 0.009501 -0.0084352 0.0666544 -0.0342271 0.099331 -0.0581291 0.0966362 0.0596114 0.107251 -0.0009678 -0.0011505 -0.0204999 0.0089643 -0.0769877 -0.0199482 -0.0598095 0.0937643 0.1055632 0.0070643 0.0146856 0.0014154 0.1362812 0.003892 0.0473841 -0.0130299 -0.0219429 0.0828471 0.0319262 0.0450698 0.0571365 0.1147363 -0.0087346 0.0376796 -0.0573604 0.0000614 0.0283431 -0.0975866 0.0584428 -0.0450731 0.0188927 0.060169 0.0381806 0.0718776 0.0917692 0.0164706 -0.030615 -0.0922006 -0.0374776 0.0711105 -0.0688787 -0.0984648 -0.0164056 0.0484237 0.0312369 -0.0775609 0.0616852 -0.0823824 0.01858 0.0599547 0.0641968 0.0070218 0.0861888 0.0768743 0.0599067 -0.0206244 0.072499 0.0495559 0.0345145 -0.0015577 0.0851978 0.0705767 0.0176633 -0.0538099 -0.1030912 -0.0216253 0.1026418 -0.0528971 -0.0561247 -0.0602751 0.0188708 0.1086444 0.0003064 0.0022384 -0.0249353 -0.0276951 -0.0061146 0.0068184 -0.0251371 0.1296419 0.0740939 -0.0032719 0.0037028 0.0144107 0.0895372 -0.0797123 0.0772329 -0.0737554 -0.0709188 0.0998346 0.0215156 -0.0149275 0.034361 0.0806476 0.0649106 -0.0454829 0.0820132 0.0386426 unknown
polarizability: 131.3966647|3.7852427|102.8601512|-0.2009339|0.8095762|100.0664408 unknown
InChI: InChI=1S/C8H12N2O4/c1-5(11)9(6(2)12)10(7(3)13)8(4)14/h1-4H3
charge 0 multiplicity 1
26 atoms
O  -0.504353 2.050972 -0.872472
O  -2.632613 -1.128918 0.872222
O  2.746099 0.494843 1.151493
O  0.414638 -1.165419 -1.929176
N  -0.68972 -0.014444 0.180098
N  0.729479 -0.075129 0.10094
C  -1.278089 1.145888 -0.476955
C  -1.386341 -1.14932 0.724986
C  1.492835 0.560945 1.141613
C  1.237663 -0.632999 -1.145895
C  -2.776382 1.196606 -0.64495
C  -0.524392 -2.33881 1.110438
C  0.691183 1.290214 2.205551
C  2.716543 -0.537364 -1.428378
H  -3.011516 2.097074 -1.232465
H  -3.15215 0.294076 -1.154807
H  -3.290664 1.229878 0.329779
H  -0.038892 -2.764899 0.215068
H  -1.182325 -3.096772 1.559596
H  0.268936 -2.070549 1.829349
H  -0.044671 0.634894 2.702646
H  0.141739 2.136092 1.756639
H  1.399822 1.675534 2.952853
H  3.071215 0.503889 -1.353496
H  2.883961 -0.929466 -2.443051
H  3.305394 -1.111316 -0.693825
