program: Gaussian 09
title: 000165082
version: EM64L-G09RevD.01
frameworkgroup: C1[X(C26H23N2O3S)]
method: RPBEPBE
basis: SDD
operation: Freq
keyword: #p
keyword: freq=noraman
keyword: PBEPBE/SDD
title: #p freq=noraman PBEPBE/SDD
converged: YES YES NO NO
title: Mulliken charges:
elementType: S O O O N N C C C C C C C C C C C C C C C C C C C C C C C C C C H H H H H H H H H H H H H H H H H H H H H H H
charge: 0.860051 -0.220558 -0.510620 -0.499624 -0.127931 0.062829 -0.406644 0.605673 0.318531 -0.187168 0.303221 -0.428153 0.319392 0.505853 0.000871 -0.508542 -0.391517 -0.387262 -0.008472 -0.406213 -0.403491 -0.323886 -0.342302 -0.240783 -0.216085 -0.641244 -0.639686 -0.264667 -0.237866 -0.207604 -0.201637 -0.208297 0.340826 0.289984 0.287440 0.292796 0.243729 0.255174 0.255200 0.242438 0.265570 0.287104 0.256824 0.257366 0.250855 0.232164 0.238915 0.250924 0.234045 0.232331 0.283258 0.276927 0.255065 0.252427 0.252471
chargesum: 1.00000
title: Mulliken charges with hydrogens summed into heavy atoms:
elementType: S O O O N N C C C C C C C C C C C C C C C C C C C C C C C C C C
charge: 0.860051 -0.220558 -0.510620 -0.499624 -0.127931 0.062829 -0.406644 0.605673 0.318531 -0.187168 0.303221 -0.087327 0.319392 0.505853 0.000871 -0.218557 -0.104077 -0.094465 -0.008472 0.092690 0.094146 -0.058317 -0.055198 0.016041 0.041281 0.080689 0.077614 0.018590 0.039061 0.047461 0.050790 0.044174
polarizability: 7.97634709e+02 -8.82008698e+01 3.50875329e+02 9.60067228e+00 5.94947477e+00 2.14342919e+02
1716.lowfreq: -5.3214 -0.0011 -0.0009 0.0004 1.8357 6.0193 22.0284 24.1844 30.4678
frequency: 20.9142 23.8994 30.4395 39.1770 43.9999 63.8105 71.1917 87.8135 93.8466 105.1841 118.2471 145.0897 151.7031 156.0436 173.8843 178.8972 188.2275 205.4199 213.8345 219.1194 229.3345 242.3033 248.0311 287.4126 292.1560 320.4541 341.7539 346.9957 364.4957 380.9274 402.8565 405.9841 418.4046 430.6783 438.5992 448.8799 466.6147 493.0802 501.0786 520.3690 523.6235 527.6216 548.9758 568.3139 580.7847 601.6902 620.9228 633.8025 641.1562 657.0808 681.9642 687.2451 703.0509 712.7906 745.9578 759.3685 764.6658 781.4371 790.3356 792.7326 796.8618 800.8902 822.6175 835.0121 847.9990 856.3250 861.2161 882.6834 919.5212 921.7975 924.7837 934.8965 936.0784 938.3076 976.6597 981.3503 983.1522 985.2849 990.3193 1006.6611 1007.8052 1011.4494 1017.5950 1039.6730 1047.6630 1064.7546 1070.3045 1080.8333 1086.9777 1091.8852 1116.4779 1153.4147 1156.7289 1173.9169 1178.6201 1179.1235 1180.6972 1188.0257 1200.6957 1234.8351 1253.6887 1273.9238 1282.2598 1288.3130 1305.3211 1332.9837 1333.4905 1339.5378 1357.0514 1377.4354 1381.7468 1385.3429 1398.5181 1399.6013 1402.4773 1426.8129 1433.3498 1438.8351 1445.6481 1453.1761 1468.7138 1470.0018 1474.3259 1480.3852 1482.0301 1499.6280 1505.5880 1515.2457 1535.5557 1538.4185 1545.5169 1572.4988 1576.9523 1603.5400 1608.9142 1646.1661 2996.9156 2997.2531 3023.7024 3028.8304 3072.0297 3076.6783 3099.8887 3100.5016 3102.3397 3103.8602 3133.1757 3145.8237 3151.0568 3152.0917 3159.3757 3162.4999 3169.0977 3171.7491 3173.4942 3180.3230 3182.8200 3193.0971 3195.9472
redmass: 5.3665 4.2920 4.5980 4.5885 4.3985 4.0860 3.8910 4.2295 3.8916 4.5283 4.2687 5.1283 5.2122 5.0387 5.4563 3.9085 2.3587 4.3719 1.2120 4.0401 1.6821 7.5018 7.7817 4.5229 4.2005 3.5600 6.6760 4.9748 5.2921 8.1301 2.8265 5.6931 3.8563 4.2414 3.6203 4.1970 4.8455 5.1752 5.0550 4.2649 4.3800 4.4011 4.5275 4.6201 8.4732 6.4898 4.0876 3.7487 5.7181 6.8092 6.5577 2.4107 4.0944 5.7259 3.7027 5.4742 1.4672 5.4776 1.4266 1.1755 1.7949 3.3573 1.5901 2.1572 1.2913 1.5832 3.3044 4.3750 1.8059 2.4713 3.9160 1.4461 2.0874 2.5826 5.8304 1.3264 1.4740 3.2158 1.5488 4.3872 2.6798 1.3596 1.3869 2.1452 2.0461 2.5658 1.8502 1.6013 2.9594 1.8292 2.8226 1.7726 1.5012 1.7926 1.7576 1.2039 1.1354 1.1819 2.2493 2.8600 1.6085 1.2377 1.3455 1.7393 1.3051 1.4082 1.4666 1.7524 2.9362 3.3306 3.3641 8.0140 1.1950 1.8088 1.9607 2.6505 6.6952 2.2612 3.2709 2.0239 1.0538 1.0445 1.5587 1.1462 1.6163 1.1731 2.4770 1.6213 3.9733 6.1658 4.3158 5.8236 7.2589 6.9004 5.9862 7.4390 1.0360 1.0361 1.0605 1.0610 1.1033 1.1025 1.1008 1.1000 1.1020 1.1023 1.0921 1.0862 1.0877 1.0881 1.0926 1.0906 1.0970 1.0895 1.0956 1.1017 1.1004 1.0943 1.0939
irintensity: 0.6576 0.5535 0.9586 0.0501 0.4044 0.9402 0.0324 1.0389 0.4694 2.0235 0.6835 2.1213 0.8109 1.4756 0.4415 9.5739 1.1368 0.8033 1.2217 3.0922 0.0779 3.2417 3.9739 0.7149 1.3504 1.5217 3.7416 3.4842 1.5745 10.2039 0.0679 52.0400 1.8882 1.7257 9.4471 33.4515 45.6901 24.7937 110.5287 22.8355 20.8149 24.9471 10.6543 14.5723 19.6096 0.1151 0.3043 3.6743 8.3933 7.5662 44.6596 38.6342 3.7610 2.6982 2.4659 3.3724 79.4194 19.3026 4.2031 7.9362 79.3114 42.4773 25.4099 8.8386 0.5624 48.8327 6.4092 25.0172 8.9190 4.9853 53.5197 5.7980 11.7554 2.9838 6.1267 0.9871 0.7918 3.0245 2.7893 0.8530 38.8922 0.9306 0.3361 7.8644 37.4309 12.1149 98.3549 2.3498 12.6622 17.1142 13.0985 3.3375 11.2138 114.2438 14.5633 4.8254 7.6196 4.2700 33.2359 183.8501 58.4704 11.4576 2.2373 1.7706 5.9617 85.8046 128.3954 17.0373 164.9958 11.8424 210.0652 13.2220 1.4284 116.1701 173.3584 24.2908 275.3037 24.9159 67.8696 12.2055 12.3605 18.9589 44.2594 6.5686 22.9953 32.8820 155.3795 152.1192 86.8176 31.7867 11.8542 20.9885 421.6452 2.3371 12.6242 343.4188 13.8016 14.8731 26.6205 32.6516 0.9453 1.3795 16.6902 29.2733 1.9219 60.7912 38.4437 0.6265 4.1358 3.7878 0.4309 4.3767 1.6716 0.5181 2.0086 17.6691 14.1100 1.6223 2.5180
temp: 298.150 k
press: 1.00000 atm
elementType: 16 8 8 8 7 7 6 6 6 6 6 6 6 6 6 6 6 6 6 6 6 6 6 6 6 6 6 6 6 6 6 6 1 1 1 1 1 1 1 1 1 1 1 1 1 1 1 1 1 1 1 1 1 1 1
symmnumber: 1
zpe: 1120447.0 jmol-1
zpe.correction: 0.426756 hartree
zpe.thermalcorrener: 0.455072 hartree
zpe.thermalcorrenthalpy: 0.456016 hartree
zpe.thermalcorrgfe: 0.366736 hartree
zpe.sumelectzpe: -1735.171456 hartree
zpe.sumelectthermal: -1735.143140 hartree
zpe.sumelectthermalent: -1735.142196 hartree
zpe.sumelectthermalfe: -1735.231476 hartree
dipole: 13.7331 1.6654 6.1529
dipole: 15.1403
quadrupole: -22.6937 -158.3764 -194.8792
quadrupole: -21.9371 -23.9873 -7.6195
quadrupole: 102.6228 -33.0600 -69.5628 -21.9371 -23.9873 -7.6195
hfenergy: -1735.5982119 hartree
pointgroup: C01 [X(C26H23N2O3S1)]
dipole: -5.3443356 -0.5764422 2.5666219 debye
polarizability: 795.756005|-91.320866|351.7237794|-22.5138809|-6.158211|215.3731726 unknown
InChI: InChI=1S/C26H23N2O3S/c1-3-28(4-2)18-14-15-22-23(16-18)31-24-17-25(32(29,30)19-10-6-5-7-11-19)20-12-8-9-13-21(20)26(24)27-22/h5-17H,3-4H2,1-2H3
charge 1 multiplicity 1
55 atoms
S  3.679184 1.058859 -1.476844
O  -1.390755 0.759601 -0.511504
O  2.972809 2.447684 -1.973168
O  4.61704 0.148972 -2.455355
N  -6.171062 0.91969 0.217419
N  -1.365841 -1.988356 0.267609
C  2.158612 -0.021579 -0.903049
C  2.267183 -1.413877 -0.573903
C  1.051773 -2.088806 -0.150398
C  -0.202711 -1.352492 -0.118679
C  -0.20035 0.026142 -0.511528
C  0.971792 0.701212 -0.900396
C  -2.580119 0.126722 -0.131623
C  -4.987933 0.230562 0.223314
C  -2.517192 -1.275257 0.257948
C  -3.752288 0.863107 -0.156666
C  3.486276 -2.161749 -0.647764
C  1.103822 -3.46194 0.214671
C  4.648739 1.434143 0.107406
C  -6.236457 2.376521 -0.096045
C  -7.48243 0.273298 0.518542
C  -4.945945 -1.174647 0.622719
C  -3.763932 -1.889264 0.638163
C  3.505568 -3.513613 -0.28661
C  2.316587 -4.163566 0.154324
C  -6.3614 2.658675 -1.609592
C  -7.813662 0.266047 2.026413
C  5.819949 0.699314 0.348207
C  4.191643 2.487293 0.916546
C  6.563378 1.025644 1.506494
C  4.948708 2.793037 2.071188
C  6.12381 2.060671 2.365452
H  0.96198 1.75143 -1.215394
H  -3.706946 1.902243 -0.485793
H  4.38704 -1.681285 -1.038831
H  0.180704 -3.952481 0.534428
H  -5.353885 2.882261 0.331632
H  -7.116112 2.779926 0.435019
H  -8.251221 0.842909 -0.032117
H  -7.496046 -0.747634 0.101975
H  -5.86459 -1.676183 0.93271
H  -3.736224 -2.939267 0.94248
H  4.439378 -4.079965 -0.354967
H  2.348592 -5.221031 0.434948
H  -6.435793 3.747166 -1.77744
H  -7.267385 2.189061 -2.031011
H  -5.48891 2.282934 -2.171156
H  -8.807572 -0.187383 2.185213
H  -7.073685 -0.31371 2.604851
H  -7.840933 1.290735 2.436737
H  6.160825 -0.064099 -0.358761
H  3.304989 3.067655 0.641497
H  7.487174 0.481819 1.727053
H  4.629728 3.609021 2.72721
H  6.708195 2.309332 3.257327
