program: Gaussian 09
title: 000165125
version: EM64L-G09RevD.01
frameworkgroup: C1[X(C18H25NO13)]
method: RPBEPBE
basis: SDD
operation: Freq
keyword: #p
keyword: freq=noraman
keyword: PBEPBE/SDD
title: #p freq=noraman PBEPBE/SDD
converged: YES YES NO NO
title: Mulliken charges:
elementType: O O O O O O O O O O O O O N C C C C C C C C C C C C C C C C C C H H H H H H H H H H H H H H H H H H H H H H H H H
charge: -0.259764 -0.356030 -0.267912 -0.462893 -0.450979 -0.416899 -0.451485 -0.266118 -0.427091 -0.431588 -0.438865 -0.211802 -0.213857 0.022583 -0.058999 -0.125554 -0.100012 0.033501 -0.099911 -0.169068 -0.144686 -0.200148 -0.025872 -0.045925 -0.380802 -0.382918 0.380458 -0.294389 -0.361786 -0.364740 -0.334771 0.380145 0.224994 0.228991 0.241766 0.208945 0.251213 0.250149 0.201987 0.274322 0.220237 0.225909 0.270191 0.189399 0.213445 0.240765 0.394690 0.372745 0.358323 0.367467 0.338579 0.355023 0.367555 0.285468 0.264716 0.290325 0.290974
chargesum: 0.00000
title: Mulliken charges with hydrogens summed into heavy atoms:
elementType: O O O O O O O O O O O O O N C C C C C C C C C C C C C C C C C C
charge: -0.259764 -0.356030 -0.267912 -0.068203 -0.078234 -0.058576 -0.084018 -0.266118 -0.088513 -0.076565 -0.071310 -0.211802 -0.213857 0.022583 0.165995 0.103437 0.141754 0.242446 0.151302 0.081081 0.057302 0.074174 0.194364 0.179983 0.078787 0.071292 0.380458 -0.008920 -0.097070 -0.074415 -0.043797 0.380145
polarizability: 3.91030467e+02 -9.64205072e+00 2.43735891e+02 -1.95835872e+00 -1.96764916e+01 1.59378427e+02
1716.lowfreq: -11.2096 -7.6018 -0.0009 -0.0006 -0.0002 1.4053 6.9495 16.6195 19.9803
frequency: -4.0543 16.4673 19.9743 35.3602 39.2009 45.4663 58.0618 70.6178 74.7027 86.9717 95.5952 98.4387 110.4375 122.4432 129.9190 146.7387 151.3186 177.6904 190.5329 199.4156 213.4467 214.1010 226.2070 244.3793 264.1249 279.0861 289.4661 297.0130 303.3272 321.4172 328.0699 332.5968 340.9162 355.2277 372.9129 384.5233 397.8343 403.6656 407.7536 415.2115 424.3302 432.6484 439.2929 451.2215 454.9641 476.0065 485.1948 498.4438 513.0834 529.3474 558.6184 568.1560 580.2218 588.5499 602.7547 619.6408 627.4077 639.3797 643.2328 663.6855 687.1894 731.0759 760.7249 816.0801 823.8311 846.4257 853.7700 855.9767 906.9788 914.0312 933.9181 959.0753 963.2457 967.3490 976.2158 984.5394 986.9440 987.9467 997.0076 1005.6521 1008.8910 1017.4765 1024.1120 1027.8187 1030.1491 1049.3275 1053.0048 1071.5344 1078.4220 1082.1201 1095.4858 1102.3745 1106.3346 1110.7561 1111.4438 1118.9031 1127.4409 1169.2881 1179.1331 1183.1200 1186.7501 1196.6973 1199.4944 1217.0216 1221.0815 1225.1570 1227.7860 1245.8876 1254.5732 1259.2330 1272.6387 1281.1475 1289.5558 1292.8837 1300.5425 1313.3620 1321.1160 1327.3536 1333.2800 1335.1963 1342.1650 1344.9923 1348.4554 1357.7171 1363.6235 1364.9911 1368.6439 1373.3100 1376.3471 1384.1716 1386.4199 1407.1827 1415.7165 1431.0627 1456.7962 1465.9383 1477.0560 1506.5571 1593.7643 1610.6146 2907.5468 2931.0577 2936.8983 2941.0003 2957.5295 2960.9795 2972.4001 2979.6199 2992.2753 3008.6891 3009.6199 3072.8984 3090.5472 3104.4612 3168.5618 3169.3981 3186.7793 3190.5082 3197.3089 3525.2900 3526.8964 3544.1690 3544.7429 3559.0888 3571.5362
redmass: 7.2894 6.6186 8.5017 6.4856 7.1163 7.4235 7.0445 6.9026 6.0256 5.7948 6.2894 7.0460 7.0989 5.3440 5.4667 7.3570 4.9094 3.5188 3.7797 4.6263 5.2244 4.1682 5.1797 4.4657 4.1462 4.9289 1.9533 4.4926 4.1737 4.5247 3.5132 1.2571 4.1332 5.3365 2.2140 1.5754 2.2383 2.6515 2.8238 2.9323 4.0857 2.5279 2.9299 1.3848 1.6510 3.7690 4.9840 3.1297 5.9067 4.9806 3.5640 3.7128 4.4953 4.2542 4.0673 5.0859 3.8682 5.6959 5.6448 4.5206 1.1120 4.9358 8.5532 6.4250 1.2912 2.7694 1.7999 2.2754 7.2923 7.3051 5.1016 5.9726 6.4416 6.2347 1.3936 4.0251 1.5151 4.2321 2.9397 3.6937 4.4134 3.0744 3.1987 3.0163 4.0625 2.8664 2.5631 3.9315 4.6136 3.0685 3.1657 3.2105 2.8651 2.4652 1.3348 2.1300 2.7290 1.4487 1.2500 1.2932 1.2888 1.3045 1.2783 2.7680 1.2069 4.8626 1.3324 1.2107 1.2657 1.1732 1.2324 1.2001 1.2201 1.2834 1.2246 1.2602 1.3245 1.2933 1.3360 1.3746 1.4273 1.2117 1.2333 3.9372 1.5276 1.2692 1.4052 1.3111 1.4433 1.3741 1.3021 8.5474 1.6499 4.1666 1.0809 1.0801 2.4541 1.2399 7.7481 6.7583 1.0818 1.0834 1.0825 1.0835 1.0744 1.0802 1.0802 1.0674 1.0843 1.0849 1.0852 1.0860 1.0965 1.0952 1.0894 1.0890 1.0963 1.0972 1.0682 1.0660 1.0673 1.0657 1.0656 1.0657 1.0661
irintensity: 0.1258 0.0435 0.1882 0.4219 1.3316 0.2723 1.1593 2.8456 0.1694 5.5125 5.2380 2.7442 1.9623 3.8121 1.2293 4.8501 0.9693 3.2526 0.9935 11.4245 2.3238 5.4842 11.9205 6.1927 5.3670 5.9108 73.2144 14.7693 28.2901 19.1332 35.4147 73.1808 38.6195 19.7062 52.9178 72.2738 66.3553 50.2896 35.2724 4.0965 8.1762 59.8215 52.7014 86.6909 238.5768 3.8292 2.1562 4.3099 5.5143 6.8518 14.7685 34.7344 4.7542 22.8792 14.2942 3.9934 44.9484 24.2839 22.8624 12.7890 243.5273 8.9851 3.6847 29.8173 4.6626 26.0355 55.0382 38.6980 219.5751 72.4498 260.7636 9.8858 222.3741 378.9822 13.5037 9.6014 0.7156 42.1365 2.5835 62.5539 243.7942 47.0328 33.1357 33.3880 146.2802 41.4192 62.3949 28.6527 3.9061 44.6805 34.1641 1.6527 20.8746 75.5142 39.1864 17.1238 73.1830 261.3871 9.6913 12.1722 9.0197 7.7641 35.2376 406.0222 97.3870 192.8017 15.3651 15.4473 9.1227 9.1839 9.8196 16.5380 35.5041 0.4663 10.8276 13.7112 14.2311 28.5377 1.9730 17.4361 15.8091 2.8280 9.1668 79.0068 27.8618 16.2078 13.0291 21.1131 1.4086 9.1065 10.2600 32.5241 18.6573 18.2788 7.8033 5.6686 87.1239 28.6493 51.1829 185.0019 26.8393 6.8820 57.7460 19.5129 33.9520 3.1767 23.4501 39.4983 41.9614 21.5086 54.7844 13.2076 16.9360 4.2073 1.0808 2.5975 1.5820 6.2370 698.0954 19.6046 58.6633 11.6463 20.9317 25.5157 12.8991
temp: 298.150 k
press: 1.00000 atm
elementType: 8 8 8 8 8 8 8 8 8 8 8 8 8 7 6 6 6 6 6 6 6 6 6 6 6 6 6 6 6 6 6 6 1 1 1 1 1 1 1 1 1 1 1 1 1 1 1 1 1 1 1 1 1 1 1 1 1
symmnumber: 1
zpe: 1145352.7 jmol-1
zpe.correction: 0.436242 hartree
zpe.thermalcorrener: 0.467378 hartree
zpe.thermalcorrenthalpy: 0.468323 hartree
zpe.thermalcorrgfe: 0.373113 hartree
zpe.sumelectzpe: -1730.933588 hartree
zpe.sumelectthermal: -1730.902451 hartree
zpe.sumelectthermalent: -1730.901507 hartree
zpe.sumelectthermalfe: -1730.996716 hartree
dipole: -8.5431 0.8325 -1.9422
dipole: 8.8006
quadrupole: -229.4430 -209.5082 -185.4398
quadrupole: 32.4191 6.2115 0.1493
quadrupole: -21.3126 -1.3779 22.6905 32.4191 6.2115 0.1493
hfenergy: -1731.3698293 hartree
pointgroup: C01 [X(C18H25N1O13)]
dipole: 3.3257364 0.1352301 0.953672 debye
polarizability: 390.8289672|6.4211257|233.2082894|9.6791934|34.2172218|170.1075279 unknown
InChI: InChI=1S/C18H25NO13/c20-5-9-11(22)12(23)14(25)18(30-9)32-16-10(6-21)31-17(15(26)13(16)24)29-8-3-1-7(2-4-8)19(27)28/h1-4,9-18,20-26H,5-6H2
charge 0 multiplicity 1
57 atoms
O  2.211565 -0.684707 -0.619739
O  4.018183 0.663567 0.01164
O  -1.358672 -0.433344 0.417038
O  1.867093 2.214162 0.179717
O  3.902846 -3.031779 -0.316405
O  -0.801846 3.125052 -0.625511
O  6.69512 -2.395249 -0.6985
O  -2.837423 1.392767 0.520945
O  7.647591 -0.019442 0.751557
O  -1.238785 -3.222213 -0.012287
O  4.711186 3.073776 1.683078
O  -8.206518 -1.553742 -1.346351
O  -9.041564 0.100488 -0.013223
N  -8.05931 -0.532113 -0.567611
C  1.038528 -0.114645 0.097134
C  0.820267 1.355924 -0.355171
C  -0.158377 -1.019542 -0.238483
C  3.433391 -0.707757 0.101741
C  4.413831 -1.685011 -0.555286
C  -0.53478 1.901067 0.124948
C  5.812185 -1.524262 0.07733
C  6.32506 -0.068392 0.097855
C  5.277604 0.839676 0.777019
C  -1.661024 0.882597 -0.150733
C  -0.041318 -2.445873 0.308313
C  5.584259 2.341677 0.768118
C  -4.093721 0.84466 0.21096
C  -4.286746 -0.286855 -0.622824
C  -5.196024 1.511074 0.802006
C  -5.595346 -0.734108 -0.880934
C  -6.500724 1.061106 0.550709
C  -6.687545 -0.057491 -0.295338
H  1.227761 -0.128665 1.191959
H  0.828108 1.369638 -1.46781
H  -0.317701 -1.053882 -1.338163
H  3.277847 -0.953656 1.177668
H  4.479481 -1.457571 -1.638776
H  -0.49132 2.082307 1.218437
H  5.753767 -1.884793 1.133315
H  6.524164 0.27965 -0.930278
H  5.108149 0.521206 1.832277
H  -1.845867 0.794087 -1.245996
H  0.802939 -2.961945 -0.174126
H  0.132111 -2.406681 1.405401
H  5.517949 2.723152 -0.272126
H  6.608242 2.505949 1.141493
H  2.746451 1.769706 -0.039146
H  4.562158 -3.673257 -0.687322
H  -1.544866 3.608772 -0.183713
H  7.63015 -2.218889 -0.41638
H  7.542814 -0.211985 1.720535
H  -2.012294 -2.765723 0.409518
H  3.781525 3.103333 1.334771
H  -3.43639 -0.827142 -1.045338
H  -5.007759 2.373899 1.446794
H  -5.783273 -1.601253 -1.519447
H  -7.371731 1.554876 0.988541
