program: Gaussian 09
title: 000164996
version: EM64L-G09RevD.01
frameworkgroup: C1[X(C8H11ClN2O)]
method: RPBEPBE
basis: SDD
operation: Freq
keyword: #p
keyword: freq=noraman
keyword: PBEPBE/SDD
title: #p freq=noraman PBEPBE/SDD
converged: YES YES NO NO
title: Mulliken charges:
elementType: Cl O N N C C C C C C C C H H H H H H H H H H H
charge: -0.038667 -0.253847 -0.304749 -0.576612 -0.280353 -0.370225 0.482306 -0.308292 -0.334698 -0.208750 -0.233209 -0.243357 0.194562 0.231557 0.250952 0.208017 0.253678 0.248146 0.253766 0.227777 0.232723 0.268806 0.300471
chargesum: 0.00000
title: Mulliken charges with hydrogens summed into heavy atoms:
elementType: Cl O N N C C C C C C C C
charge: -0.038667 -0.253847 -0.056603 -0.007336 0.145766 0.088743 0.482306 -0.308292 -0.081020 0.045015 -0.005432 -0.010633
polarizability: 1.55332919e+02 9.02403094e+00 1.26565258e+02 -1.70164167e+00 4.34551358e-01 5.84048259e+01
1716.lowfreq: -0.0012 0.0013 0.0014 1.9571 3.6528 8.5621 34.5331 54.6483 77.1002
frequency: 34.4743 54.6480 77.0868 87.8018 143.8522 153.9239 181.5558 228.6738 261.6452 318.9549 365.5705 387.2416 420.8714 440.9690 477.6935 519.3779 540.8626 584.7902 668.7873 710.2550 714.2522 750.0557 795.7679 829.3400 846.7025 924.1438 967.9471 972.9547 1012.5582 1022.0025 1041.5984 1088.8038 1123.7125 1130.3725 1163.2117 1171.3950 1188.5608 1233.7768 1241.2042 1265.7845 1271.7731 1319.8517 1374.2885 1392.0403 1428.0424 1463.7754 1470.5132 1479.9668 1492.3444 1574.0907 1604.3306 1652.0286 2924.8149 2952.6794 3033.3481 3094.9234 3137.4918 3153.3049 3165.8352 3176.7456 3353.0397 3425.3155 3599.6020
redmass: 4.2339 3.9024 3.1169 2.6831 2.9184 4.2429 5.1768 4.2624 5.5638 3.6094 2.5974 2.2257 1.5904 3.2321 2.3782 4.8822 3.8398 6.1494 6.2290 3.2695 1.4408 1.2948 5.2038 1.2824 1.2724 1.3640 1.3155 7.3800 2.3785 7.6235 2.0199 3.0265 1.7961 1.5445 2.1805 1.0667 1.2018 2.8848 1.6639 1.5086 1.1921 1.2603 3.7139 1.7629 2.3489 1.8134 1.1942 1.2250 1.1013 6.3029 7.1600 1.0853 1.0713 1.0597 1.1016 1.0923 1.0857 1.0900 1.0940 1.1004 1.0745 1.0463 1.0980
irintensity: 2.6602 1.7905 5.2094 2.7056 6.4301 0.3980 1.2750 3.0240 0.2944 13.4389 40.6724 89.4007 139.3054 6.7093 26.8524 9.8453 0.3245 12.7431 43.8375 3.2855 64.4523 109.0224 11.6570 2.2201 0.8676 2.5482 0.5132 76.6510 2.3551 63.5435 28.7366 0.5407 4.5527 9.3931 1.3858 5.2175 11.8309 177.8887 8.6883 40.0372 7.3387 0.3678 11.4473 13.8442 20.2771 112.3201 27.7329 12.8460 3.6946 13.2167 44.8752 5.4570 62.6643 43.9582 33.1474 18.7969 2.7808 11.2347 16.2754 11.1753 18.6412 20.1462 3.4645
temp: 298.150 k
press: 1.00000 atm
elementType: 17 8 7 7 6 6 6 6 6 6 6 6 1 1 1 1 1 1 1 1 1 1 1
symmnumber: 1
zpe: 476612.1 jmol-1
zpe.correction: 0.181532 hartree
zpe.thermalcorrener: 0.194032 hartree
zpe.thermalcorrenthalpy: 0.194976 hartree
zpe.thermalcorrgfe: 0.141199 hartree
zpe.sumelectzpe: -955.261121 hartree
zpe.sumelectthermal: -955.248621 hartree
zpe.sumelectthermalent: -955.247676 hartree
zpe.sumelectthermalfe: -955.301453 hartree
dipole: 2.1444 -2.8811 1.4655
dipole: 3.8790
quadrupole: -56.4907 -77.0758 -79.9430
quadrupole: 1.6753 6.5632 0.3292
quadrupole: 14.6791 -5.9060 -8.7731 1.6753 6.5632 0.3292
hfenergy: -955.4426526 hartree
pointgroup: C01 [X(C8H11Cl1N2O1)]
dipole: 0.6743718 1.3178007 -0.3710946 debye
dipolederiv: -0.1238622 0.1392738 0.0268926 0.1425679 -0.6866949 -0.1180276 0.0285484 -0.1202341 -0.0757198 -1.9481356 -0.1035007 0.0446706 0.0425387 -0.2538174 0.0043311 0.0562842 0.006978 -0.2595436 -0.1110704 -0.0816695 0.1401643 0.0084303 -0.317395 -0.3314762 -0.0642432 -0.2711605 -0.1516598 -0.2048914 -0.1574025 -0.0170457 -0.1556251 -0.4501169 0.3789989 0.1968454 0.3041856 -0.261907 0.8787298 0.1529868 0.0155827 0.5270799 0.336875 -0.0451721 0.0678149 -0.0560408 0.3835753 0.3533336 0.1652432 0.0250492 0.1068362 0.2744265 0.1306525 -0.1096601 0.0947267 0.2568915 1.5133418 0.0173948 -0.0430564 -0.4288688 -0.1873052 -0.0411263 -0.1186145 -0.0600484 0.129569 -0.206466 -0.1752311 -0.0267967 -0.3056459 0.9904908 0.206313 -0.0484387 0.205353 -0.0728478 -0.245979 -0.1081287 -0.0155073 0.3342505 -0.0352636 0.0209501 0.0640694 0.0374803 -0.2017758 0.049844 0.0235686 0.000569 0.0319646 -0.1055668 -0.0027684 0.0014771 -0.0036144 -0.0946909 0.0960515 0.1030697 0.011255 -0.0509988 0.1107217 0.0489086 -0.0168795 0.0453015 -0.1406242 -0.0332572 -0.0388559 -0.0114092 -0.0058882 -0.1314417 0.0114631 -0.0064959 0.0123708 -0.1924415 -0.0276287 0.0226778 -0.033242 -0.1017705 -0.0885944 0.1044447 -0.0093933 0.1214244 -0.066157 -0.0115159 0.0185282 0.0413703 -0.0833375 -0.0131696 -0.0778055 0.012998 -0.0877695 -0.0985399 0.0816974 0.0094405 -0.0342642 -0.0000623 0.0079527 0.0696774 -0.0119431 0.0832597 -0.0247723 -0.0206047 -0.0488342 -0.0015181 -0.0708758 -0.0760758 -0.1209289 -0.0260513 -0.1627262 -0.1154753 0.0077939 -0.0896524 -0.0116805 -0.106787 0.0079519 -0.0261873 -0.0164449 -0.0271678 0.1633174 0.0115352 0.0203461 -0.0827904 -0.004693 0.1707092 0.1421918 -0.0809844 0.2273072 0.0002271 0.0259187 -0.0707684 -0.0087141 -0.0835412 0.0162438 -0.0241132 -0.01168 -0.0241221 0.1585977 0.0621028 0.0464755 0.0114137 0.0674655 -0.0953774 -0.0486624 0.0153817 -0.0481575 0.1525338 -0.1086175 0.0496488 0.0171075 0.044908 0.0634601 -0.0210425 0.01634 -0.0210549 0.1686318 -0.0758789 0.100038 0.0260453 0.1296483 0.2742422 -0.1079931 0.0788558 -0.149054 0.0836895 0.0375589 0.0053515 -0.0740956 -0.037596 0.1877449 -0.1526278 -0.0177862 -0.1072368 0.2591218 unknown
polarizability: 157.2057279|-4.77378|122.4895079|-1.5042917|11.9689873|60.6077663 unknown
InChI: InChI=1S/C8H11ClN2O/c9-7-3-1-2-4-8(7)12-6-5-11-10/h1-4,11H,5-6,10H2
charge 0 multiplicity 1
23 atoms
Cl -1.348266 -2.787504 -0.43756
O  0.489804 -0.489532 -0.079854
N  3.96953 0.79736 -0.125412
N  5.251734 0.28437 0.203735
C  1.546555 0.528953 0.063767
C  2.882815 -0.207085 -0.097392
C  -0.83575 -0.07419 0.037153
C  -1.840279 -1.067937 -0.112409
C  -1.243527 1.26161 0.290716
C  -3.205345 -0.752256 -0.015511
C  -2.615855 1.582929 0.388803
C  -3.600471 0.583481 0.236808
H  1.420324 1.307693 -0.718989
H  1.49122 1.009381 1.059459
H  3.064993 -0.859227 0.770866
H  2.835207 -0.855372 -1.002353
H  -0.494181 2.048492 0.414987
H  3.951652 1.373386 -0.982683
H  -3.949766 -1.544999 -0.136603
H  -2.910506 2.619237 0.586016
H  -4.663986 0.830063 0.312567
H  5.800068 -0.163162 -0.539758
H  5.77653 0.876908 0.846749
