program: Gaussian 09
title: 000164977
version: EM64L-G09RevD.01
frameworkgroup: C1[X(C7H6ClNO2S)]
method: RPBEPBE
basis: SDD
operation: Freq
keyword: #p
keyword: freq=noraman
keyword: PBEPBE/SDD
title: #p freq=noraman PBEPBE/SDD
converged: YES YES NO NO
title: Mulliken charges:
elementType: Cl S O O N C C C C C C C H H H H H H
charge: -0.026306 0.918177 -0.495115 -0.518496 -0.478649 -0.210203 0.485557 -0.463397 -0.231063 -0.344158 -0.204382 -0.088018 0.251788 0.264177 0.314234 0.278762 0.274728 0.272365
chargesum: 0.00000
title: Mulliken charges with hydrogens summed into heavy atoms:
elementType: Cl S O O N C C C C C C C
charge: -0.026306 0.918177 -0.495115 -0.518496 -0.164415 -0.210203 0.485557 0.052568 0.047699 -0.069431 0.067984 -0.088018
polarizability: 1.70157513e+02 3.40929635e+00 1.19435078e+02 -7.23799975e-01 1.13496173e+00 7.03849079e+01
1716.lowfreq: -7.7210 -0.6486 0.0025 0.0027 0.0035 7.8148 63.2950 78.4852 133.3668
frequency: 63.2935 78.4739 133.3654 161.4998 194.0266 219.8147 234.7200 286.2324 340.9744 356.3651 374.4448 426.0467 427.7274 466.0504 509.3454 533.6716 584.3966 685.9290 693.7535 788.3454 818.2233 830.8674 848.1151 878.2864 952.4611 954.5509 985.1119 1006.2204 1027.1440 1068.2166 1134.6950 1168.6358 1186.6320 1226.4295 1262.8917 1338.9628 1387.3048 1402.0202 1440.9636 1461.3593 1576.1601 1609.4061 2950.5661 3031.1303 3160.5259 3163.0027 3184.1542 3424.3727
redmass: 10.3251 4.9205 7.5966 10.0202 2.7943 6.4096 6.5320 8.9528 5.6385 8.2067 5.6156 5.0705 3.0166 10.6293 8.7803 3.9207 3.8076 6.0433 3.9218 2.3720 1.3353 14.9874 3.6981 1.4034 6.1039 1.5966 1.7490 6.5767 4.6412 1.9649 1.4804 1.0825 2.0528 1.2592 1.2577 1.4747 9.0506 3.6010 2.0948 1.1765 6.9813 8.2752 1.0639 1.0971 1.0934 1.0900 1.0974 1.0765
irintensity: 4.0453 1.4138 0.6070 10.1994 6.9974 6.5411 4.8669 2.9415 21.7685 18.4589 48.7637 75.5645 12.3672 21.0590 14.8582 7.5112 25.2278 17.5751 0.3952 13.8335 40.8111 138.4445 27.4367 14.5280 84.1127 22.5399 6.6244 1.3065 4.9259 24.4044 7.6904 4.9417 63.5924 7.1402 11.8830 2.1721 1.4389 24.2409 28.8261 1.8180 39.7957 7.7875 31.9959 5.4037 0.1629 0.7240 0.8032 18.7818
temp: 298.150 k
press: 1.00000 atm
elementType: 17 16 8 8 7 6 6 6 6 6 6 6 1 1 1 1 1 1
symmnumber: 1
zpe: 311249.7 jmol-1
zpe.correction: 0.118549 hartree
zpe.thermalcorrener: 0.129711 hartree
zpe.thermalcorrenthalpy: 0.130655 hartree
zpe.thermalcorrgfe: 0.080915 hartree
zpe.sumelectzpe: -1332.603391 hartree
zpe.sumelectthermal: -1332.592228 hartree
zpe.sumelectthermalent: -1332.591284 hartree
zpe.sumelectthermalfe: -1332.641024 hartree
dipole: 3.7803 3.2745 0.4916
dipole: 5.0254
quadrupole: -100.0998 -70.3820 -94.3111
quadrupole: -11.6119 -1.0512 1.0745
quadrupole: -11.8355 17.8823 -6.0468 -11.6119 -1.0512 1.0745
hfenergy: -1332.7219393 hartree
pointgroup: C01 [X(C7H6Cl1N1O2S1)]
dipole: 1.4416037 -1.3361914 -0.2133138 debye
dipolederiv: -0.8651895 0.0599463 -0.0252767 0.0992779 -0.1111932 -0.0006409 -0.0217727 -0.0027198 -0.0525332 1.7734077 -0.1841936 0.0153297 -0.2464604 1.4272506 -0.0076154 0.0378398 0.0375769 1.3028403 -0.6665113 0.0689269 0.0215107 0.1246342 -0.4833029 -0.0591482 0.1277833 -0.1030489 -0.5650271 -0.6809221 0.064962 -0.0242768 0.0466381 -0.555744 0.0186929 -0.1655715 0.1502922 -0.6829817 -0.5460729 0.0302341 0.1213082 -0.0397005 -0.6128656 0.0716693 0.1811439 -0.0012186 -0.4026319 -0.1530616 0.0484567 0.015442 0.0235151 -0.1867361 -0.0103266 -0.014806 -0.0603858 -0.2260394 -0.0307834 0.1275686 0.0236143 -0.0920759 0.1316542 -0.0025424 0.0406213 0.01954 0.0282851 0.286272 -0.2463026 -0.0611031 -0.1198323 -0.0091278 0.0293939 -0.0905212 0.0674924 0.2347907 -0.0136858 -0.1079002 -0.0149945 0.214478 0.0841584 0.0142629 -0.0019665 0.028423 -0.0593265 -0.3884122 -0.141791 -0.025384 -0.0400123 -0.0140001 0.0057415 -0.0093441 0.0123638 -0.0980034 -0.3552287 0.1533046 -0.0021564 0.0851927 -0.0709166 0.0029254 0.0029457 0.0127401 -0.0974319 1.3372398 -0.1018547 0.0415633 -0.1627563 0.202299 0.0098142 0.0298788 0.0099734 -0.0411766 -0.0271753 0.0042897 0.01796 0.0254383 0.0206447 -0.0610008 0.0377839 -0.1279642 -0.0924482 0.0172203 0.12928 -0.0261289 0.0452259 -0.0325489 0.0570735 0.0080458 0.0460562 0.0526449 0.153122 0.0749023 -0.0717549 0.02551 0.1256115 -0.0434691 -0.1596041 -0.0639902 0.21381 0.0760266 0.0600997 0.0027259 0.0112751 0.0410065 -0.0070944 -0.0007049 -0.0093041 0.151859 0.0610555 0.0208448 0.0000781 0.0456841 0.0003301 -0.0070118 0.0033202 -0.0024611 0.1636102 0.0226991 -0.0607736 -0.0084568 -0.0460316 0.04348 -0.010724 -0.0050714 -0.0133655 0.1697598 unknown
polarizability: 169.5916361|-5.7062905|119.5219395|4.3753515|3.694545|70.8639227 unknown
InChI: InChI=1S/C7H6ClNO2S/c8-6-1-2-7-5(3-6)4-9-12(7,10)11/h1-3,9H,4H2
charge 0 multiplicity 1
18 atoms
Cl 4.232538 -0.183079 0.098515
S  -2.156836 0.430156 -0.122009
O  -2.857463 1.254126 1.079802
O  -2.633888 0.736991 -1.651274
N  -2.133784 -1.425937 0.264547
C  -0.28429 0.412557 -0.001369
C  0.209728 -0.897469 -0.067017
C  -0.834782 -2.00377 -0.177016
C  0.519354 1.556796 0.090446
C  1.606841 -1.089024 -0.037203
C  1.919413 1.365785 0.122724
C  2.431846 0.050667 0.055005
H  -0.854365 -2.395167 -1.216781
H  -0.579363 -2.835094 0.505886
H  -2.971509 -1.845385 -0.173216
H  0.089197 2.560955 0.146001
H  2.04135 -2.092468 -0.077292
H  2.597913 2.21916 0.201948
