program: Gaussian 09
title: 000164957
version: EM64L-G09RevD.01
frameworkgroup: C1[X(C9H9NO2)]
method: RPBEPBE
basis: SDD
operation: Freq
keyword: #pfreq=noraman
keyword: PBEPBE/SDD
title: #p freq=noraman PBEPBE/SDD
converged: NO NO NO NO
title: Mulliken charges:
elementType: O O N C C C C C C C C C H H H H H H H H H
charge: -0.232785 -0.414219 -0.412130 0.241916 0.332654 -0.468374 -0.560065 0.221663 -0.399444 0.163329 -0.239154 -0.538051 0.243504 0.230167 0.301021 0.252988 0.251466 0.348897 0.246759 0.214934 0.214926
chargesum: 0.00000
title: Mulliken charges with hydrogens summed into heavy atoms:
elementType: O O N C C C C C C C C C
charge: -0.232785 -0.065322 -0.111110 0.241916 0.332654 -0.224870 -0.329898 0.221663 -0.146456 0.163329 0.012312 0.138568
polarizability: 1.69888725e+02 -2.66366441e+00 1.19379658e+02 4.87949629e-03 -1.47337929e-03 5.02105158e+01
1716.lowfreq: -5.1533 -0.0008 -0.0006 -0.0004 7.7361 9.3754 82.8280 139.8384 149.3176
frequency: 82.7263 139.8381 149.3096 194.1977 247.4335 298.5988 321.5313 335.8302 355.8816 371.6925 423.4793 448.1826 480.0575 490.2564 588.3492 599.5682 687.9495 719.9135 724.4736 750.4663 750.5445 818.8708 829.6233 833.5648 853.7443 894.5923 981.9286 1061.9095 1075.9533 1103.0875 1114.0530 1152.7996 1164.1918 1181.6360 1231.6958 1257.7324 1303.8797 1333.8503 1374.7814 1432.8423 1436.5375 1466.4139 1471.2068 1476.3717 1491.1209 1517.6018 1599.4908 1644.0199 2942.8964 3024.1575 3116.1266 3118.0458 3155.1931 3210.1365 3237.1139 3577.3674 3615.1188
redmass: 3.1871 5.3614 4.3675 3.5036 1.1918 5.1172 1.1807 4.0567 4.3109 4.1883 2.8649 6.9711 5.8163 1.2882 4.4972 2.7193 4.0608 1.6663 6.2318 1.7943 6.2316 1.5520 1.7202 4.2162 1.5001 3.8269 5.9737 1.6497 2.2569 1.7135 1.2634 1.3985 1.5566 1.8816 2.1103 1.6282 1.9771 3.1685 4.0685 3.7216 1.2818 1.0498 1.8159 1.6500 3.7131 3.8895 6.8042 7.5373 1.0340 1.1031 1.0915 1.0980 1.0909 1.0908 1.1063 1.0659 1.0809
irintensity: 5.3580 6.4831 0.5735 3.8551 0.0182 9.8066 94.0182 0.0707 6.5791 54.9057 2.6488 0.5768 7.5271 89.3590 14.9639 6.7011 11.7209 45.4219 5.9051 28.7493 0.6013 61.1645 4.2391 38.7524 32.3743 7.1860 22.6764 14.4995 53.5724 216.2209 0.2111 40.2824 44.5380 99.3893 5.9166 110.8777 29.0497 81.6776 8.0192 33.8658 0.2621 12.7936 72.4073 30.7783 17.1955 45.2614 17.7444 19.0230 71.7709 58.1740 17.2282 24.9656 8.3555 2.7319 4.2176 28.7351 50.1902
temp: 298.150 k
press: 1.00000 atm
elementType: 8 8 7 6 6 6 6 6 6 6 6 6 1 1 1 1 1 1 1 1 1
symmnumber: 1
zpe: 426229.1 jmol-1
zpe.correction: 0.162342 hartree
zpe.thermalcorrener: 0.172694 hartree
zpe.thermalcorrenthalpy: 0.173638 hartree
zpe.thermalcorrgfe: 0.126951 hartree
zpe.sumelectzpe: -552.668649 hartree
zpe.sumelectthermal: -552.658298 hartree
zpe.sumelectthermalent: -552.657354 hartree
zpe.sumelectthermalfe: -552.704041 hartree
dipole: 1.8190 -2.5431 0.0008
dipole: 3.1267
quadrupole: -67.1605 -48.4409 -75.3397
quadrupole: 2.2066 -0.0020 -0.0009
quadrupole: -3.5134 15.2062 -11.6927 2.2066 -0.0020 -0.0009
hfenergy: -552.8309916 hartree
pointgroup: C01 [X(C9H9N1O2)]
dipole: -0.7438896 0.9797144 0.0003033 debye
dipolederiv: -1.5052364 -0.5331075 -0.0000202 -0.632232 -0.5970769 -0.0000082 0.0001543 -0.0000292 -0.2759448 -0.8240524 0.6590846 0.0000373 0.7841673 -0.6618512 -0.0000311 0.0000115 -0.0000073 -0.3966142 -0.358012 -0.1216216 -0.0000003 0.1947628 -0.5930646 -0.0000126 -0.0000061 -0.000001 -0.280038 0.204366 -0.1341961 -0.0000145 -0.4874471 0.1726422 0.0000266 -0.0000144 0.0000284 0.0097477 0.1359514 -0.1717813 -0.000012 0.2212323 -0.1483942 -0.0000098 -0.0000167 0.0000092 0.0230236 -0.1142605 -0.0228099 -0.0000087 0.119695 -0.0584355 -0.0000032 0.0000605 -0.0000091 -0.2315571 -0.0184311 0.1705968 -0.0000144 -0.0926724 0.019104 -0.0000057 -0.000012 -0.0000088 -0.2228911 1.2919595 0.412002 -0.0000207 0.6750514 0.1370714 -0.0000844 -0.0001995 -0.0000809 0.0647652 0.0217525 0.1630455 -0.0000257 -0.0015167 -0.1331689 0.0000029 -0.0000238 -0.000011 -0.2874625 0.4923707 -0.5847084 -0.0000339 -1.0278538 0.6259867 0.0000508 -0.0000668 0.0000081 0.019997 -0.2360064 0.2483038 0.0000015 0.2123976 0.4568003 -0.0000199 0.0000357 -0.0000272 -0.1901984 0.3855791 0.1238614 0.0000241 0.5470691 0.6298042 0.0000122 0.0000948 0.000047 0.3417674 0.0803323 -0.0301725 0.0000092 -0.0629747 -0.0827767 0.0000058 0.0000128 0.0000125 0.1854798 0.0658062 -0.00857 0.0000046 0.0095369 -0.1305386 -0.0000002 0.0000106 0.0000029 0.1792967 0.1683587 -0.0368184 0.0000124 -0.0393263 0.1803611 0.0000029 0.0000109 0.0000057 0.3437031 0.0206518 -0.0581397 0.000013 -0.1041141 -0.0042069 0.0000067 0.0000146 0.0000038 0.2017149 -0.0361079 0.0466333 0.0000126 0.0669895 0.0758187 -0.0000006 0. 0.0000026 0.2202813 0.2387456 -0.2209431 -0.0000062 -0.15704 0.1770719 0.0000012 0.000004 0.0000012 0.374925 -0.1636691 -0.0612571 -0.0000492 -0.0191446 0.0798575 -0.000002 -0.0000468 -0.000005 0.1223072 0.0749395 0.0802887 0.1036575 -0.1032795 -0.0724294 -0.0804254 0.0271124 -0.1080428 -0.1011766 0.0749628 0.0803095 -0.1035661 -0.1033005 -0.0725751 0.080494 -0.027136 0.1081008 -0.1011261 unknown
polarizability: 169.999499|-1.219724|119.2688832|-0.0049195|0.0013336|50.2105158 unknown
InChI: InChI=1S/C9H9NO2/c1-12-9-5-7-6(2-3-10-7)4-8(9)11/h2-5,10-11H,1H3
charge 0 multiplicity 1
21 atoms
O  2.722612 0.513926 -0.000371
O  2.139248 -2.073164 -0.000261
N  -2.218642 1.42979 -0.000027
C  -1.013781 0.71274 -0.000107
C  -1.349795 -0.682597 -0.000102
C  0.323256 1.174472 -0.000181
C  -0.294746 -1.635283 -0.000159
C  1.353944 0.211377 -0.000242
C  -2.79521 -0.775802 0.000018
C  1.038173 -1.19468 -0.000226
C  -3.294479 0.526613 0.00005
C  3.089899 1.924529 0.000131
H  0.554131 2.243924 -0.000209
H  -0.513556 -2.711113 -0.000137
H  -2.301025 2.443504 -0.000032
H  -3.393558 -1.685258 0.000065
H  -4.324023 0.880175 0.000098
H  1.817151 -3.008834 -0.000276
H  4.190059 1.937877 0.000315
H  2.712118 2.44412 0.904477
H  2.712425 2.444683 -0.904025
