program: Gaussian 09
title: 000164964
version: EM64L-G09RevD.01
frameworkgroup: C1[X(C12H20O2)]
method: RPBEPBE
basis: SDD
operation: Freq
keyword: #pfreq=noraman
keyword: PBEPBE/SDD
title: #p freq=noraman PBEPBE/SDD
converged: YES YES NO NO
title: Mulliken charges:
elementType: O O C C C C C C C C C C C C H H H H H H H H H H H H H H H H H H H H
charge: -0.292674 -0.239752 -0.076287 -0.214972 -0.454549 -0.467585 -0.739492 0.212456 -0.191718 -0.180799 0.060939 -0.372465 -0.709377 -0.695888 0.221890 0.240498 0.199267 0.243486 0.217752 0.221240 0.224502 0.213210 0.213494 0.199718 0.198900 0.226252 0.193156 0.209773 0.218963 0.211869 0.245233 0.208518 0.238868 0.215575
chargesum: 0.00000
title: Mulliken charges with hydrogens summed into heavy atoms:
elementType: O O C C C C C C C C C C C C
charge: -0.292674 -0.239752 0.145603 0.025526 -0.011796 -0.028594 -0.088286 0.212456 0.008000 0.018101 0.287191 0.030464 -0.033312 -0.032926
polarizability: 1.52122371e+02 -4.79803475e-01 1.30590807e+02 -6.54162745e+00 -5.69218135e+00 1.12645377e+02
1716.lowfreq: -16.6901 -3.3663 -0.0008 -0.0007 -0.0005 6.0968 10.6417 30.6505 57.4459
frequency: -11.2824 30.2861 57.3948 83.7599 108.0275 138.1037 143.9652 174.1378 195.2830 205.1016 210.1230 228.7652 254.2146 304.0442 316.5452 375.4688 379.8023 416.7683 441.3361 452.6661 493.0058 523.4907 646.0791 682.4682 716.2300 737.4735 749.8256 808.8851 828.0181 857.4219 876.5552 893.1292 908.1476 941.3852 966.6834 968.3918 979.6637 992.7014 1001.4583 1035.8346 1060.5100 1064.5400 1088.4650 1103.9108 1115.1525 1128.8177 1132.3200 1172.3631 1179.7297 1202.6638 1224.2133 1258.4385 1261.2154 1288.9108 1295.5758 1301.6270 1327.3096 1334.7107 1352.7827 1358.4428 1376.5667 1380.3307 1384.6051 1386.8390 1389.6214 1448.6593 1452.5383 1457.9906 1465.8275 1469.9054 1475.0644 1476.5370 1478.4340 1489.9663 1629.8226 1683.1677 2959.1464 2964.4473 2968.3397 2970.3902 2980.8320 2983.8920 2988.8699 3005.8774 3013.6745 3015.6718 3032.0535 3040.2772 3064.7912 3068.5505 3075.6361 3084.8155 3088.1774 3094.3020 3097.2888 3126.7768
redmass: 4.0980 3.8988 3.5571 2.9062 2.2358 2.8709 2.4758 2.7746 2.8767 1.0770 1.0686 1.3037 2.8040 3.1625 3.0458 2.2657 2.9612 2.7765 3.1896 3.2922 2.9924 4.7375 1.5279 2.4214 4.1226 2.4838 3.0214 1.6983 2.8375 2.1775 1.8780 2.9834 2.1081 2.2059 1.2814 1.2761 2.0091 1.4360 1.7174 3.1600 2.0920 2.1480 3.0001 2.1561 2.0305 1.7089 1.8885 1.1279 1.9785 1.1335 1.4190 1.3560 1.2334 1.3658 1.2894 1.3864 1.2407 1.4775 1.6850 1.6622 1.4848 1.6335 1.2297 1.2361 1.2140 1.0939 1.0757 1.0829 1.0558 1.0469 1.0468 1.0444 1.0535 1.0523 8.8608 6.5889 1.0625 1.0681 1.0721 1.0383 1.0385 1.0521 1.0414 1.0973 1.0994 1.0870 1.0852 1.0990 1.0992 1.0994 1.0997 1.0990 1.0997 1.0837 1.1007 1.0996
irintensity: 0.4361 0.9557 0.0509 0.8370 0.1557 0.5534 0.9358 2.1771 1.4015 0.0317 0.1315 0.3661 6.7213 3.1206 1.2683 1.7797 2.7040 1.9081 0.9169 1.4474 3.5177 1.0052 33.5896 27.7541 3.2045 1.3572 2.1569 12.1955 2.9585 10.3136 13.6808 7.2475 8.6829 2.4538 7.3869 2.2974 18.6531 68.7948 7.6146 15.0141 1.0111 46.9883 289.9480 14.3360 27.2360 31.4323 32.7761 0.8043 1.4214 14.5497 1.7505 5.3732 0.6564 12.2514 4.9158 17.4959 7.1156 3.2114 9.1635 2.4077 11.9864 4.9061 14.0172 9.0825 26.3885 12.7688 2.3485 11.3555 12.3319 13.2475 3.8205 22.4528 15.1301 8.6520 121.0240 5.3865 35.6712 18.3205 20.6970 40.5646 34.5950 11.6452 39.5113 25.2053 29.3955 4.2977 18.7509 13.3086 52.3118 39.9898 43.9268 12.8151 76.2773 9.0635 25.3523 65.2988
temp: 298.150 k
press: 1.00000 atm
elementType: 8 8 6 6 6 6 6 6 6 6 6 6 6 6 1 1 1 1 1 1 1 1 1 1 1 1 1 1 1 1 1 1 1 1
symmnumber: 1
zpe: 774247.2 jmol-1
zpe.correction: 0.294895 hartree
zpe.thermalcorrener: 0.309882 hartree
zpe.thermalcorrenthalpy: 0.310826 hartree
zpe.thermalcorrgfe: 0.252922 hartree
zpe.sumelectzpe: -618.605749 hartree
zpe.sumelectthermal: -618.590763 hartree
zpe.sumelectthermalent: -618.589819 hartree
zpe.sumelectthermalfe: -618.647722 hartree
dipole: -1.0532 0.4843 1.4290
dipole: 1.8400
quadrupole: -78.7851 -83.8487 -88.1968
quadrupole: 2.1248 2.1832 -2.4747
quadrupole: 4.8251 -0.2385 -4.5866 2.1248 2.1832 -2.4747
hfenergy: -618.9006445 hartree
pointgroup: C01 [X(C12H20O2)]
dipole: -0.4204906 -0.1724523 -0.5634928 debye
polarizability: 151.9066615|-0.926091|130.3212301|6.6148432|-6.6322014|113.1306632 unknown
InChI: InChI=1S/C12H20O2/c1-4-10(3)14-12(13)11-8-6-5-7-9(11)2/h5-6,9-11H,4,7-8H2,1-3H3
charge 0 multiplicity 1
34 atoms
O  -1.397117 0.331794 -0.579734
O  0.013868 0.694917 1.243949
C  1.673187 -1.395837 -0.40753
C  0.940029 -0.113639 -0.922129
C  2.512821 -1.10597 0.861694
C  1.962995 1.031991 -1.202049
C  0.699899 -2.574215 -0.19015
C  -0.142986 0.346046 0.049073
C  3.340205 0.156212 0.737925
C  3.085734 1.117282 -0.186093
C  -2.584159 0.788014 0.232144
C  -3.777749 -0.041242 -0.266531
C  -2.742976 2.30163 0.036494
C  -3.640341 -1.548132 0.034205
H  2.381714 -1.670044 -1.217573
H  0.422563 -0.36218 -1.866243
H  3.172481 -1.974153 1.063723
H  1.841494 -1.010729 1.740141
H  1.434975 2.005202 -1.259604
H  2.393254 0.868309 -2.212572
H  -0.022149 -2.348465 0.617447
H  0.125332 -2.800481 -1.107869
H  1.250365 -3.487919 0.101503
H  4.161276 0.296434 1.454332
H  3.713197 2.018623 -0.224124
H  -2.358049 0.562667 1.292111
H  -4.691279 0.359849 0.216123
H  -3.892262 0.122171 -1.355706
H  -2.90641 2.542512 -1.029123
H  -3.610064 2.671129 0.614335
H  -1.844447 2.836087 0.389205
H  -3.574299 -1.732855 1.123023
H  -2.728551 -1.956019 -0.436551
H  -4.508152 -2.112088 -0.352747
