program: Gaussian 09
title: 000164956
version: EM64L-G09RevD.01
frameworkgroup: C1[X(C6H17NO4P)]
method: RPBEPBE
basis: SDD
operation: Freq
keyword: #p
keyword: freq=noraman
keyword: PBEPBE/SDD
title: #p freq=noraman PBEPBE/SDD
converged: YES YES NO NO
title: Mulliken charges:
elementType: P O O O O N C C C C C C H H H H H H H H H H H H H H H H H
charge: 1.400109 -0.475278 -0.486094 -0.648513 -0.639917 -0.108164 -0.336745 -0.590859 -0.552097 -0.559083 -0.325817 -0.470065 0.280572 0.307484 0.344453 0.264247 0.253766 0.267209 0.265772 0.284837 0.269153 0.273794 0.272460 0.236903 0.279881 0.421832 0.254071 0.250063 0.266023
chargesum: 1.00000
title: Mulliken charges with hydrogens summed into heavy atoms:
elementType: P O O O O N C C C C C C
charge: 1.400109 -0.475278 -0.486094 -0.226681 -0.639917 -0.108164 0.251311 0.271608 0.265722 0.256324 0.190967 0.300092
polarizability: 1.30821455e+02 -2.49337283e+00 9.65007709e+01 1.34719977e+00 1.47414275e-01 9.08653231e+01
1716.lowfreq: -22.5487 -6.1996 -0.0019 -0.0018 -0.0011 10.2821 15.3280 49.2585 67.4042
frequency: -19.8064 49.0769 67.3991 76.0137 90.1740 116.7728 161.6172 168.1203 206.3095 209.6643 217.6843 239.0995 255.1573 275.6535 283.2042 333.7070 336.1958 354.6418 362.1816 374.9921 427.3813 435.7555 457.1936 513.7003 578.1721 673.6573 717.5050 741.1765 815.4569 883.2374 917.6776 943.1071 945.4955 980.3750 999.8648 1036.7794 1047.1329 1052.4155 1064.2874 1109.2805 1114.1106 1123.1878 1134.8662 1201.1241 1218.0516 1252.8457 1267.2806 1319.6301 1350.5174 1398.3991 1425.7729 1425.9961 1433.2593 1442.3866 1455.3465 1456.5223 1461.8734 1464.7330 1466.8947 1472.8993 1475.2026 1484.8892 1487.9348 1503.5860 3008.7695 3009.4438 3014.4129 3023.3764 3025.8351 3039.0690 3100.9086 3121.3650 3122.2667 3129.2616 3140.1152 3142.0354 3144.4868 3147.6055 3148.1597 3156.3141 3592.9609
redmass: 6.0475 3.2760 2.6466 3.6575 1.1977 2.6283 2.9546 4.4215 6.1843 1.2394 1.6092 1.0912 1.6836 1.1272 2.4416 4.5477 4.2417 3.1277 3.2739 4.1850 2.6528 2.9440 3.2660 3.3291 7.9164 7.3481 3.2037 8.7340 1.5812 3.2397 2.9402 5.0999 4.0506 3.8474 1.3925 3.5522 6.5217 1.2564 1.4062 1.2340 1.4158 1.2745 1.4476 1.4639 1.8217 1.7181 1.2683 1.2390 1.2142 1.2051 1.1226 1.1489 1.1393 1.0870 1.0478 1.0511 1.0720 1.0790 1.0536 1.0940 1.0530 1.0537 1.0520 1.0566 1.0412 1.0287 1.0570 1.0320 1.0331 1.0592 1.1027 1.1065 1.1068 1.1055 1.1058 1.1053 1.1051 1.1052 1.1057 1.1055 1.0670
irintensity: 1.8129 1.8396 9.6816 4.1220 0.3131 10.1164 14.0558 20.3489 1.4481 4.3243 74.3045 3.4728 4.1218 5.1309 56.2130 23.2769 17.9714 15.0604 7.9063 18.0810 6.0969 0.7161 8.2651 4.4168 21.2897 216.6458 6.2045 201.1181 0.3691 47.5179 11.3209 172.5573 84.1799 83.5876 44.5856 23.8011 213.6744 8.0660 1.2578 0.4725 0.6615 0.4564 2.9955 2.7789 0.2806 0.3758 0.4260 1.6229 2.7115 7.0314 4.8623 14.1047 15.7901 2.3955 1.3836 16.8245 10.4601 9.1954 20.9330 15.4245 3.2927 67.2407 42.0329 71.2989 6.8064 24.9888 36.2087 3.4689 3.1396 8.5070 1.6920 4.1537 15.5738 12.0378 0.4417 0.1570 6.7196 6.7725 6.2466 3.1867 144.8543
temp: 298.150 k
press: 1.00000 atm
elementType: 15 8 8 8 8 7 6 6 6 6 6 6 1 1 1 1 1 1 1 1 1 1 1 1 1 1 1 1 1
symmnumber: 1
zpe: 636539.0 jmol-1
zpe.correction: 0.242445 hartree
zpe.thermalcorrener: 0.257948 hartree
zpe.thermalcorrenthalpy: 0.258892 hartree
zpe.thermalcorrgfe: 0.200437 hartree
zpe.sumelectzpe: -934.412893 hartree
zpe.sumelectthermal: -934.397390 hartree
zpe.sumelectthermalent: -934.396446 hartree
zpe.sumelectthermalfe: -934.454901 hartree
dipole: 7.9711 1.4539 -0.5879
dipole: 8.1239
quadrupole: -16.5448 -65.8524 -81.7858
quadrupole: 2.1658 -0.2382 2.9025
quadrupole: 38.1829 -11.1247 -27.0581 2.1658 -0.2382 2.9025
hfenergy: -934.655338 hartree
pointgroup: C01 [X(C6H17N1O4P1)]
dipole: -3.1415399 0.2630232 -0.5263965 debye
polarizability: 129.6925267|6.5556114|94.5647754|2.9542129|-2.2715265|93.9302471 unknown
InChI: InChI=1S/C6H17NO4P/c1-7(2,3)5-6-11-12(8,9)10-4/h8H,5-6H2,1-4H3
charge 1 multiplicity 1
29 atoms
P  1.598996 -0.061422 0.643209
O  0.657653 1.417086 0.630526
O  2.76045 0.113138 -0.586872
O  2.372091 0.222866 2.137663
O  0.706422 -1.364223 0.46183
N  -2.750538 -0.108099 -0.142486
C  -1.679736 0.645008 0.681294
C  -2.106816 -1.162368 -1.059229
C  -3.664721 -0.82981 0.85148
C  -3.5770 0.872823 -0.969415
C  -0.58994 1.360124 -0.158308
C  3.758202 1.229039 -0.563528
H  -2.218584 1.360951 1.324344
H  -1.199238 -0.1198 1.311962
H  -1.268127 -1.639207 -0.525186
H  -2.878325 -1.897833 -1.332669
H  -1.731411 -0.678134 -1.972288
H  -4.05635 -0.103739 1.580254
H  -4.497277 -1.293893 0.30133
H  -3.080969 -1.605395 1.369794
H  -4.096813 1.568769 -0.292891
H  -2.912072 1.432071 -1.644183
H  -4.312073 0.309577 -1.564486
H  -0.413237 0.85642 -1.127097
H  -0.831289 2.417972 -0.342694
H  2.790736 -0.563752 2.572916
H  4.344301 1.203777 0.369671
H  3.245679 2.198949 -0.674117
H  4.398784 1.022003 -1.431623
