program: Gaussian 09
title: 000164938
version: EM64L-G09RevD.01
frameworkgroup: C1[X(C5H9NO4)]
method: RPBEPBE
basis: SDD
operation: Freq
keyword: #pfreq=noraman
keyword: PBEPBE/SDD
title: #p freq=noraman PBEPBE/SDD
converged: NO YES NO NO
title: Mulliken charges:
elementType: O O O O N C C C C C H H H H H H H H H
charge: -0.303118 -0.170277 -0.257086 -0.255252 -0.298354 -0.218728 -0.671377 0.319269 0.309231 -0.738971 0.230136 0.229590 0.212595 0.230735 0.230734 0.372795 0.262769 0.262813 0.252494
chargesum: 0.00000
title: Mulliken charges with hydrogens summed into heavy atoms:
elementType: O O O O N C C C C C
charge: -0.303118 -0.170277 -0.257086 -0.255252 0.074442 0.240998 0.002687 0.319269 0.309231 0.039106
polarizability: 1.18858610e+02 -2.27725909e+00 7.61110965e+01 4.22857358e-02 7.93741173e-02 4.81193514e+01
1716.lowfreq: -92.9214 -41.5202 -14.9080 -7.8140 0.0007 0.0008 0.0013 0.5302 22.4833
frequency: -92.9069 -29.6152 -13.7150 79.9965 81.1679 91.7183 189.1159 196.2297 243.8838 264.1607 309.7291 360.7799 464.3884 481.8148 566.7206 607.7458 681.7634 683.4104 796.8093 798.8023 889.2401 939.6473 1000.2081 1023.0431 1040.6574 1063.1331 1111.2401 1137.6593 1157.5947 1192.1499 1248.1917 1348.5996 1387.4260 1395.2513 1420.4207 1451.3702 1453.4969 1461.8077 1476.8504 1490.5359 1655.4916 1694.8540 2996.6715 3009.2867 3013.5013 3067.8887 3093.7118 3101.6857 3109.4439 3148.6109 3506.5802
redmass: 1.0537 2.2775 6.3171 6.3662 4.4249 3.2449 4.3651 5.8973 1.1603 8.5781 4.5474 3.2929 1.2160 4.2208 2.6760 6.4879 6.6299 7.2788 4.3446 1.0940 4.6111 3.7939 2.6330 2.5830 1.5888 9.5279 2.2265 1.4529 2.0804 3.7756 1.1345 1.3243 1.2358 1.2610 2.0374 1.0447 1.0570 1.0408 1.0515 1.0806 10.2842 10.4635 1.0357 1.0579 1.0368 1.1071 1.0984 1.0976 1.1027 1.1009 1.0799
irintensity: 0.4978 0.0367 1.4159 10.3139 3.7434 1.6267 18.3415 2.4128 0.3368 1.0607 5.0704 4.8635 133.0723 14.2079 43.6189 1.5207 12.9396 5.9140 37.2282 4.2509 15.1996 49.9853 6.0913 1.7843 11.6299 460.3789 2.0191 4.8948 362.8504 75.2461 0.0495 52.3084 14.2219 77.7584 240.5840 20.2939 26.1402 12.1138 3.6979 12.2233 521.5831 44.5091 19.8138 25.4464 0.3281 10.1604 30.0839 3.7405 45.7286 4.9486 101.8685
temp: 298.150 k
press: 1.00000 atm
elementType: 8 8 8 8 7 6 6 6 6 6 1 1 1 1 1 1 1 1 1
symmnumber: 1
zpe: 376730.9 jmol-1
zpe.correction: 0.143489 hartree
zpe.thermalcorrener: 0.153098 hartree
zpe.thermalcorrenthalpy: 0.154043 hartree
zpe.thermalcorrgfe: 0.107820 hartree
zpe.sumelectzpe: -550.745393 hartree
zpe.sumelectthermal: -550.735784 hartree
zpe.sumelectthermalent: -550.734839 hartree
zpe.sumelectthermalfe: -550.781062 hartree
dipole: 0.3765 -0.6064 0.0202
dipole: 0.7140
quadrupole: -37.5993 -69.0747 -57.5012
quadrupole: 6.9905 0.0758 0.0043
quadrupole: 17.1257 -14.3496 -2.7761 6.9905 0.0758 0.0043
hfenergy: -550.8888819 hartree
pointgroup: C01 [X(C5H9N1O4)]
dipole: -0.1528274 0.2355931 0.007331 debye
dipolederiv: -1.9034468 -0.2340935 -0.0012816 -0.5105519 -0.6098089 -0.0003164 -0.003073 0.0006985 -0.3138157 -0.987489 0.3153109 -0.0000471 0.6597114 -0.4995964 -0.0035919 0.0121248 -0.0013126 -0.0672335 -0.6982257 0.0544688 -0.0010611 0.1783635 -1.0554708 0.0064352 -0.0045682 0.0062275 -0.3409382 -0.5723019 -0.1267224 0.0019939 0.4869148 -0.9922983 0.0004485 0.0006741 0.0038231 -0.3059541 -0.9400822 0.3036611 -0.0062771 0.6397437 -0.4299195 0.0062894 -0.0283594 0.0078558 -0.4007225 1.113598 0.0426452 -0.0004746 -0.1723766 0.2418782 0.0008334 0.0011547 0.0007024 0.3599435 -0.1129288 -0.0896149 -0.000354 -0.0630872 -0.0163327 -0.0009101 -0.0004734 -0.0008292 0.0631302 2.5105439 -0.1536301 0.0122678 -0.2458757 1.6149261 -0.0104322 0.0219076 -0.0117435 0.3623503 1.6131905 -0.1470858 -0.0087516 -0.8844425 1.3949876 -0.0005279 -0.0094291 -0.0039926 0.2082278 -0.2989649 -0.1364932 0.0032097 -0.2181237 -0.1647262 0.0030767 0.006141 0.0032045 0.0208691 -0.0547843 -0.0217463 0.0111834 0.0685321 -0.0017088 0.0932228 -0.0285137 0.1045286 -0.0631679 -0.0562186 -0.0210977 -0.0110273 0.0683814 -0.0010046 -0.0934477 0.0291988 -0.1053013 -0.0657547 -0.1549508 0.0571723 -0.0002018 0.0743543 0.0513228 0.0000332 -0.0002629 -0.0000311 0.1169739 0.1149428 0.0246556 -0.0407146 -0.0289761 0.0054128 0.1014643 -0.0128743 0.1180577 -0.0631198 0.1149033 0.0248675 0.0415165 -0.0284633 0.0070419 -0.1010199 0.0135305 -0.1173482 -0.0644925 0.1694624 0.0478604 0.0006742 -0.1054035 0.2503233 -0.0003944 0.0047616 -0.0029713 0.3962183 0.0825596 0.0036602 0.032862 -0.0025648 0.0832539 -0.0850835 -0.0050093 -0.0915829 0.0120874 0.0817309 0.0038313 -0.0335131 -0.0018779 0.0873059 0.0832586 0.0037865 0.0894938 0.0082914 -0.0215386 0.0523506 -0.0000036 0.0857421 0.0344137 0.0006619 -0.0007163 0.0005207 0.1371073 unknown
polarizability: 118.9320389|-1.4270287|76.0367329|-0.1061832|-0.1677076|48.1202863 unknown
InChI: InChI=1S/C5H9NO4/c1-3-9-5(8)6-10-4(2)7/h6H,3H2,1-2H3
charge 0 multiplicity 1
19 atoms
O  1.897912 0.391662 0.011887
O  -1.557914 -0.547811 0.011864
O  0.958281 -1.783046 0.022532
O  -2.571563 1.552274 0.013274
N  -0.327583 0.196236 -0.005259
C  3.262106 -0.214168 0.012414
C  4.251663 0.946187 0.01877
C  0.841382 -0.538329 0.01131
C  -2.691887 0.308812 0.018289
C  -3.945712 -0.525274 0.033815
H  3.359349 -0.857883 0.905278
H  3.36299 -0.850897 -0.885154
H  5.284777 0.553353 0.019673
H  4.121659 1.580187 -0.874567
H  4.117545 1.573444 0.916242
H  -0.425512 1.216902 -0.002304
H  -3.977837 -1.187923 -0.847678
H  -3.969032 -1.167527 0.930689
H  -4.820226 0.140302 0.031025
