program: Gaussian 09
title: 000164942
version: EM64L-G09RevD.01
frameworkgroup: C1[X(C9H9Cl2NO2)]
method: RPBEPBE
basis: SDD
operation: Freq
keyword: #p
keyword: freq=noraman
keyword: PBEPBE/SDD
title: #p freq=noraman PBEPBE/SDD
converged: YES YES NO NO
title: Mulliken charges:
elementType: Cl Cl O O N C C C C C C C C C H H H H H H H H H
charge: -0.014122 -0.006873 -0.369069 -0.248539 -0.208688 0.449292 -0.478925 0.226831 -0.411030 -0.351356 -0.663932 -0.027189 -0.178743 -0.123438 0.260906 0.221690 0.300203 0.314896 0.230061 0.214260 0.233612 0.259436 0.370718
chargesum: 0.00000
title: Mulliken charges with hydrogens summed into heavy atoms:
elementType: Cl Cl O O N C C C C C C C C C
charge: -0.014122 -0.006873 0.001649 -0.248539 -0.208688 0.449292 0.003670 0.226831 -0.110827 -0.036460 0.014002 -0.027189 0.080693 -0.123438
polarizability: 2.13731627e+02 1.81816542e+00 1.34587731e+02 -1.83020837e+00 8.89540694e-01 6.29282443e+01
1716.lowfreq: -4.0084 -0.0014 0.0013 0.0014 6.4036 10.3094 28.8286 44.7316 66.8934
frequency: 28.7473 44.7184 66.8711 97.7058 116.3957 166.6799 176.3839 187.8343 204.4831 221.3365 259.0241 303.9464 310.8474 339.5759 343.2706 418.6134 438.2159 443.6600 494.8484 534.7677 566.0483 578.9945 649.2982 665.7288 688.6170 752.2251 794.5952 826.7083 886.0221 892.1208 966.4568 989.3223 998.5021 1024.8834 1077.8903 1079.4291 1121.6127 1151.1113 1160.4693 1243.3172 1245.4851 1277.8763 1324.8452 1336.9449 1368.0587 1397.2877 1398.8404 1435.9183 1456.0010 1468.2293 1478.7704 1560.4629 1593.7087 1603.5842 2988.8456 3001.4987 3042.8744 3098.3076 3106.1837 3167.9608 3195.0889 3214.0646 3439.3657
redmass: 4.7503 7.5351 2.3097 3.4392 5.1369 4.9745 19.3274 1.2755 7.1158 5.7984 7.8041 6.0674 1.2447 5.7929 4.4559 9.7776 5.7483 3.2603 9.1166 2.6329 6.3789 5.6870 5.6425 7.2649 3.7085 5.5049 1.3517 1.3420 1.4541 5.6643 1.3171 4.3228 3.3620 2.3070 1.6102 2.7492 2.1236 1.4488 2.5809 1.4035 1.2947 2.7624 1.2481 2.0320 6.4679 1.3422 3.0752 1.0958 2.7061 1.0390 1.0533 8.8170 6.8186 8.7296 1.0630 1.0369 1.0959 1.1002 1.1003 1.0914 1.0916 1.0948 1.0683
irintensity: 0.9186 4.2412 0.0858 2.1172 0.8898 4.5400 0.0307 1.1728 0.1447 5.8631 0.8786 16.8834 92.3885 14.1124 41.0070 1.5419 1.5409 6.9293 29.4225 2.8732 8.5839 4.5227 4.4099 16.0924 1.5096 5.8394 13.9221 39.7184 40.3918 21.4409 1.4504 37.1107 8.8626 18.6279 1.0898 11.7398 52.0259 17.5391 135.0911 30.9145 27.4069 166.4703 43.6835 126.2687 10.0730 20.5121 35.5176 24.0266 253.1201 12.6506 15.1015 12.2619 60.1543 105.3353 20.2547 27.3355 5.3223 28.5113 30.5155 1.0812 1.7949 8.9709 11.1570
temp: 298.150 k
press: 1.00000 atm
elementType: 17 17 8 8 7 6 6 6 6 6 6 6 6 6 1 1 1 1 1 1 1 1 1
symmnumber: 1
zpe: 427733.6 jmol-1
zpe.correction: 0.162915 hartree
zpe.thermalcorrener: 0.177365 hartree
zpe.thermalcorrenthalpy: 0.178309 hartree
zpe.thermalcorrgfe: 0.119983 hartree
zpe.sumelectzpe: -1472.595997 hartree
zpe.sumelectthermal: -1472.581547 hartree
zpe.sumelectthermalent: -1472.580603 hartree
zpe.sumelectthermalfe: -1472.638930 hartree
dipole: -3.2243 2.0556 2.0104
dipole: 4.3201
quadrupole: -98.0511 -93.5883 -94.4273
quadrupole: -9.9333 -3.7851 3.0943
quadrupole: -2.6955 1.7673 0.9283 -9.9333 -3.7851 3.0943
hfenergy: -1472.7589124 hartree
pointgroup: C01 [X(C9H9Cl2N1O2)]
dipole: -1.2966859 0.7762609 0.7777272 debye
dipolederiv: -0.3993364 -0.2964033 0.0364588 -0.3820264 -0.4271347 0.0450133 0.0437698 0.0364384 -0.0434183 -0.7804646 0.1979595 0.008834 0.2295449 -0.1232977 -0.0002292 0.0032738 -0.0022102 -0.0287731 -0.6155686 0.0024633 0.0248149 0.0115889 -0.4595792 -0.0739926 0.097983 -0.0928245 0.0621159 -0.7064078 0.0141665 -0.0169925 -0.5631255 -0.9119523 -0.115338 -0.107279 -0.0789359 -0.3245432 -1.6809093 -0.2438926 -0.084795 -0.3868136 0.0780411 0.0457945 -0.223402 0.0574419 -0.1897908 1.2055704 -0.142307 -0.0446479 -0.3417022 0.0154222 -0.0347594 -0.0305086 -0.0041626 0.0945427 -0.1765789 0.1124919 -0.0097967 0.2868982 -0.0728544 0.010888 0.039911 0.0010886 0.1351414 1.8124432 0.2571551 0.1460178 0.9145666 1.001205 0.1569002 0.2103076 0.1493258 0.2085992 -0.4213475 -0.0879877 0.0211273 -0.1363639 -0.1780934 0.0029179 0.0007845 -0.0279664 -0.154125 -0.2664728 0.0171764 0.0002127 0.168486 -0.0572255 -0.010444 0.0496648 -0.0024348 -0.1623644 -0.0032524 -0.0598106 -0.0126323 -0.0090686 0.0403039 -0.0138915 -0.0101531 -0.014293 0.0607078 0.4588223 0.5485666 -0.064157 0.5929839 0.6720686 -0.0687412 -0.0740923 -0.0673837 -0.0202778 -0.0849088 0.114801 -0.0115421 -0.0013042 0.0501408 -0.013801 0.0044333 -0.0032238 -0.0784274 0.8851713 -0.4724732 0.0036776 -0.4049106 -0.0688862 0.0113308 0.0102722 0.0195041 -0.0762301 0.0109397 -0.0323806 0.0271811 -0.0364166 0.0134534 0.0836187 0.0052254 0.0950658 0.0222544 -0.0040439 -0.0136574 -0.0339367 -0.0102146 0.037069 -0.0987637 -0.0065767 -0.116328 -0.0795981 0.1303747 0.028338 0.0039476 0.0149744 0.0398365 0.0090135 0.0059617 0.0134304 0.1787927 0.1527048 -0.0565479 0.0114223 -0.0199873 0.091803 0.0102288 0.0192336 -0.0054209 0.1814281 0.1087134 0.0012459 -0.0117115 -0.0662108 -0.0136192 0.1058688 0.0170033 0.1109327 -0.0336856 -0.1643711 0.0806552 -0.0132406 0.1379172 0.0204091 0.0025669 -0.008103 -0.0029369 0.1056985 0.1070945 0.014225 0.0442101 -0.0419345 0.0420655 -0.0947907 0.0050875 -0.0861725 -0.0803791 0.0635185 0.0305181 0.0009353 0.0351852 -0.0189693 0.0119604 -0.006814 0.0105086 0.1585411 0.3683092 -0.014302 -0.0253873 0.0079333 0.229794 0.0286493 -0.045983 0.0105568 0.063791 unknown
polarizability: 213.5611203|4.2226182|134.7825722|-1.1306862|0.2338174|62.9039098 unknown
InChI: InChI=1S/C9H9Cl2NO2/c1-2-9(13)12(14)6-3-4-7(10)8(11)5-6/h3-5,14H,2H2,1H3
charge 0 multiplicity 1
23 atoms
Cl 3.62854 2.044133 -0.142758
Cl 4.538583 -1.122754 0.055565
O  -1.541718 1.905882 0.238583
O  -2.391713 -1.571566 -0.120594
N  -1.323973 0.468012 0.220973
C  0.050941 0.06839 0.154321
C  -3.807555 0.443982 -0.009844
C  -2.483331 -0.318957 0.014794
C  1.043929 1.075371 0.038065
C  0.438181 -1.29988 0.226073
C  -4.999333 -0.497765 -0.256876
C  2.403807 0.716781 0.008336
C  1.805542 -1.632559 0.188687
C  2.796406 -0.634467 0.085666
H  -3.749777 1.231365 -0.784373
H  -3.933053 0.985957 0.948732
H  0.758269 2.123793 -0.059844
H  -0.320413 -2.079069 0.29181
H  -5.073826 -1.264156 0.532952
H  -5.939999 0.08032 -0.278317
H  -4.891265 -1.028162 -1.217876
H  2.109229 -2.681979 0.243111
H  -1.497871 2.16803 1.202214
