program: Gaussian 09
title: 000164920
version: EM64L-G09RevD.01
frameworkgroup: C1[X(C3H4Cl2F2S)]
method: RPBEPBE
basis: SDD
operation: Freq
keyword: #p
keyword: freq=noraman
keyword: PBEPBE/SDD
title: #p freq=noraman PBEPBE/SDD
converged: YES YES NO NO
title: Mulliken charges:
elementType: Cl Cl S F F C C C H H H H
charge: 0.069583 0.074972 0.252488 -0.139121 -0.164232 0.143697 -0.606086 -0.814894 0.350211 0.287670 0.289283 0.256429
chargesum: 0.00000
title: Mulliken charges with hydrogens summed into heavy atoms:
elementType: Cl Cl S F F C C C
charge: 0.069583 0.074972 0.252488 -0.139121 -0.164232 0.143697 -0.255875 0.018488
polarizability: 8.81918241e+01 5.56250924e+00 7.37735997e+01 -2.45953133e+00 -3.10494459e-01 4.41961726e+01
1716.lowfreq: -9.0358 -3.4213 -0.0013 0.0025 0.0033 9.8744 53.5255 55.0306 105.9833
frequency: 53.2676 55.0099 105.9748 123.4505 189.0888 216.0632 221.7290 274.9463 307.2252 375.1805 397.3735 521.0652 640.7533 680.9397 690.2754 745.7269 900.1013 928.2512 984.0240 992.1833 1125.1838 1189.2049 1249.7407 1344.5983 1444.2866 1460.1163 3028.4943 3144.7168 3152.9190 3164.6425
redmass: 7.3939 4.6323 1.1607 5.1195 9.5270 7.2276 12.1774 15.3395 19.0899 14.8259 15.1670 12.3919 7.4909 10.0005 7.8941 8.3913 5.7932 8.5427 1.2039 1.2869 7.5757 1.0762 1.2788 1.1286 1.0525 1.0540 1.0278 1.0881 1.1042 1.1069
irintensity: 0.5637 3.1957 0.3196 0.2196 3.0196 4.2934 1.0560 0.1464 0.7350 4.2345 1.9495 5.9243 8.6465 77.1729 68.7751 81.4996 130.5891 103.3876 16.3182 23.0563 36.3106 5.0994 2.3608 0.0470 14.9974 18.3860 12.6114 1.2473 3.0739 6.4798
temp: 298.150 k
press: 1.00000 atm
elementType: 17 17 16 9 9 6 6 6 1 1 1 1
symmnumber: 1
zpe: 177684.5 jmol-1
zpe.correction: 0.067676 hartree
zpe.thermalcorrener: 0.077662 hartree
zpe.thermalcorrenthalpy: 0.078606 hartree
zpe.thermalcorrgfe: 0.030574 hartree
zpe.sumelectzpe: -1633.923777 hartree
zpe.sumelectthermal: -1633.913792 hartree
zpe.sumelectthermalent: -1633.912847 hartree
zpe.sumelectthermalfe: -1633.960880 hartree
dipole: 2.4291 0.2331 -1.3714
dipole: 2.7992
quadrupole: -58.9963 -70.9482 -67.8011
quadrupole: -0.9949 1.6938 -0.2249
quadrupole: 6.9189 -5.0330 -1.8859 -0.9949 1.6938 -0.2249
hfenergy: -1633.9914538 hartree
pointgroup: C01 [X(C3H4Cl2F2S1)]
dipole: 0.951543 -0.0902401 0.5470565 debye
dipolederiv: -0.2143711 -0.1242228 -0.0123663 -0.0174554 -0.5666855 -0.0516905 -0.002632 -0.1020349 -0.0891863 -0.4251827 0.286106 -0.0339749 0.2411946 -0.4052238 0.0426271 -0.0781054 0.1057264 -0.0889333 -0.3657694 0.1169735 -0.0412817 0.1342635 -0.0525914 -0.0342649 0.0001231 -0.0386157 -0.1387106 -0.3877426 0.0258832 -0.0429306 0.1097087 -0.2957836 0.111502 -0.2041304 0.1136961 -0.8213235 -0.430468 -0.1342487 -0.0556229 0.0511028 -0.8061456 -0.1784574 -0.0062027 -0.1000477 -0.3283117 1.0574483 -0.0079089 0.1548428 -0.3768625 0.9277918 0.0614284 0.2181322 -0.0523833 1.1139538 0.5550516 -0.2722571 0.1271157 -0.1482016 1.1023303 0.0156967 0.0975353 0.0432023 0.1657672 0.1617478 0.0980311 -0.0447208 0.1222196 0.0204671 0.0259122 -0.0543724 0.0157208 0.0506641 0.0077901 0.0197444 -0.053244 0.0116263 -0.0203729 -0.005265 -0.0274071 0.0024238 0.0136987 0.0483726 -0.0348523 0.0248564 -0.0986789 -0.02989 -0.0717754 0.0325923 -0.0582658 0.0514307 0.039784 -0.0353762 -0.0108486 -0.0785211 0.0788131 0.0563217 0.0263149 0.0395001 -0.0576656 -0.0466609 0.0621278 -0.0118252 0.0496039 0.0472903 0.027965 -0.0018479 0.0310777 0.1286165 unknown
polarizability: 87.5417418|-6.0809248|74.0472574|2.8655455|-3.4763945|44.5725972 unknown
InChI: InChI=1S/C3H4Cl2F2S/c1-8-3(6,7)2(4)5/h2H,1H3
charge 0 multiplicity 1
12 atoms
Cl -1.714944 -1.908289 0.068423
Cl -2.49132 1.044365 -0.012814
S  1.483554 -1.063565 0.431182
F  0.095701 0.290976 -1.495313
F  0.513676 1.478879 0.394086
C  0.165911 0.160287 -0.074637
C  -1.209007 -0.181567 0.526579
C  2.980699 -0.04911 -0.123296
H  -1.165946 -0.13622 1.621459
H  3.055903 0.866954 0.477471
H  2.887782 0.182512 -1.1936
H  3.849591 -0.701423 0.05126
