program: Gaussian 09
title: 000164946
version: EM64L-G09RevD.01
frameworkgroup: C1[X(C12H6N4O8)]
method: RPBEPBE
basis: SDD
operation: Freq
keyword: #p
keyword: freq=noraman
keyword: PBEPBE/SDD
title: #p freq=noraman PBEPBE/SDD
converged: YES YES NO NO
title: Mulliken charges:
elementType: O O O O O O O O N N N N C C C C C C C C C C C C H H H H H H
charge: -0.183305 -0.183315 -0.183306 -0.183299 -0.199340 -0.199333 -0.199339 -0.199350 0.020207 0.020198 0.020207 0.020206 0.178001 0.177997 0.342733 0.342726 0.342721 0.342750 -0.405090 -0.405089 -0.405090 -0.405099 -0.176771 -0.176769 0.297025 0.297029 0.297026 0.297021 0.254322 0.254323
chargesum: 0.00000
title: Mulliken charges with hydrogens summed into heavy atoms:
elementType: O O O O O O O O N N N N C C C C C C C C C C C C
charge: -0.183305 -0.183315 -0.183306 -0.183299 -0.199340 -0.199333 -0.199339 -0.199350 0.020207 0.020198 0.020207 0.020206 0.178001 0.177997 0.342733 0.342726 0.342721 0.342750 -0.108065 -0.108060 -0.108065 -0.108077 0.077552 0.077554
polarizability: 2.62575320e+02 1.77545518e-02 1.80435241e+02 1.93768713e-02 3.05318764e-04 1.80358918e+02
1716.lowfreq: -6.6415 0.0004 0.0006 0.0008 4.5673 9.1101 9.1145 31.6103 31.6739
frequency: 4.5677 31.3248 31.3887 38.3903 47.4788 48.1170 48.1434 99.8476 99.8749 135.7269 186.7971 191.9261 192.2023 222.8140 264.7436 264.7535 327.1523 327.1712 335.1362 369.0703 404.8303 404.8442 461.2091 461.2666 482.3044 490.5096 490.5237 523.4283 592.7547 592.7836 642.7455 642.7628 643.7697 678.1206 678.1233 708.3882 708.3926 712.6596 714.6967 725.0086 760.7051 783.3439 823.6845 823.6875 863.2159 863.2336 969.2995 970.3717 989.1693 1008.2469 1008.2506 1078.3949 1097.6173 1109.6313 1111.1888 1164.5231 1164.5295 1193.3981 1193.4101 1194.6201 1200.3564 1200.3814 1216.8467 1243.4720 1358.6657 1358.6972 1363.2934 1366.4892 1379.9052 1379.9127 1430.9643 1436.4812 1436.4871 1466.8223 1571.9726 1571.9745 1604.7661 1606.1806 3169.2328 3169.2639 3184.3014 3184.3092 3194.3286 3194.3729
redmass: 14.8452 14.8801 14.8874 15.8974 14.8694 8.1325 8.1344 9.2951 9.2961 14.8595 4.5083 13.6125 4.5401 12.7396 9.1186 9.1184 7.5456 7.5441 13.4528 13.4139 7.6830 7.6828 6.1339 5.9919 11.9529 5.0613 5.0622 9.6946 4.4381 4.4385 8.7008 8.7010 8.3445 11.2322 11.2321 3.6519 3.6521 9.6749 9.5934 8.5945 12.7442 7.9708 1.5321 1.5321 10.1983 10.1979 1.3731 1.3724 7.6110 1.3593 1.3593 2.0012 1.9384 8.8320 3.7705 1.5114 1.5111 1.6926 1.6927 14.0488 5.6288 5.6324 14.2467 2.9433 13.2767 13.2764 11.5652 8.4087 4.6109 4.6108 3.4365 2.9857 2.9859 4.1341 6.9270 6.9271 7.7166 8.0845 1.0883 1.0883 1.0921 1.0921 1.0995 1.0995
irintensity: 0.0000 0.0258 0.0247 0.0000 0.0053 6.2917 6.2875 0.6299 0.6297 0.0000 0.0081 29.8497 0.1016 0.0000 7.8539 7.8551 0.1930 0.1930 0.8046 0.0000 1.1997 1.1997 0.0000 0.0003 2.3323 0.2854 0.2870 0.0000 0.1734 0.1732 0.0306 0.0296 0.5649 32.1811 32.1765 53.7024 53.7082 0.0000 0.0000 0.0000 0.8130 0.0000 39.5842 39.5855 37.1514 37.1412 0.0000 0.0000 0.6022 3.3444 3.3450 0.0000 44.0608 0.0006 18.2872 34.3067 34.2626 6.8423 6.8188 0.0004 371.8854 371.9848 46.6892 0.0000 96.0986 96.0215 0.0129 342.1648 12.8885 12.9373 227.1973 0.8294 0.8320 0.0000 54.4747 54.4310 24.4013 0.0000 0.0218 10.2395 10.0462 10.0459 0.0028 0.7670
temp: 298.150 k
press: 1.00000 atm
elementType: 8 8 8 8 8 8 8 8 7 7 7 7 6 6 6 6 6 6 6 6 6 6 6 6 1 1 1 1 1 1
symmnumber: 1
zpe: 475430.3 jmol-1
zpe.correction: 0.181082 hartree
zpe.thermalcorrener: 0.201316 hartree
zpe.thermalcorrenthalpy: 0.202260 hartree
zpe.thermalcorrgfe: 0.127253 hartree
zpe.sumelectzpe: -1279.633183 hartree
zpe.sumelectthermal: -1279.612949 hartree
zpe.sumelectthermalent: -1279.612005 hartree
zpe.sumelectthermalfe: -1279.687012 hartree
dipole: -0.0001 -0.0009 -0.0011
dipole: 0.0015
quadrupole: -99.0314 -156.8525 -156.8310
quadrupole: 0.0183 0.0195 -0.0002
quadrupole: 38.5402 -19.2809 -19.2594 0.0183 0.0195 -0.0002
hfenergy: -1279.8142647 hartree
pointgroup: C01 [X(C12H6N4O8)]
dipole: 0.0000436 0.0000307 -0.0005696 debye
polarizability: 262.5753264|-0.0032237|180.408401|0.0122981|-0.0364439|180.3857516 unknown
InChI: InChI=1S/C12H6N4O8/c17-13(18)7-3-1-4-8(14(19)20)11(7)12-9(15(21)22)5-2-6-10(12)16(23)24/h1-6H
charge 0 multiplicity 1
30 atoms
O  -1.598457 3.530806 0.586125
O  1.598828 -0.587865 3.530709
O  -1.598578 -3.530722 -0.586566
O  1.598132 0.587872 -3.530383
O  0.435589 2.528457 0.417655
O  -0.435358 -0.418155 2.528904
O  0.435506 -2.528545 -0.417565
O  -0.435769 0.418125 -2.527958
N  -0.858763 2.491537 0.412915
N  0.858991 -0.413712 2.491694
N  -0.858842 -2.491534 -0.413055
N  0.858596 0.413618 -2.491165
C  -0.757215 -0.000023 0.000097
C  0.75722 -0.000055 0.0002
C  -1.525421 1.184707 0.196303
C  1.525488 -0.196788 1.184817
C  -1.525454 -1.184668 -0.196497
C  1.525392 0.196672 -1.184449
C  -2.935177 1.197321 0.198357
C  2.935246 -0.199111 1.19729
C  -2.935211 -1.197164 -0.19901
C  2.935147 0.198974 -1.197077
C  -3.645055 0.000103 -0.000417
C  3.645056 -0.000079 0.000075
H  -3.444758 2.151124 0.356793
H  3.444887 -0.357955 2.150993
H  -3.444818 -2.150915 -0.357674
H  3.444697 0.357815 -2.150827
H  -4.738116 0.000151 -0.000611
H  4.738117 -0.000091 0.000027
