program: Gaussian 09
title: 000164915
version: EM64L-G09RevD.01
frameworkgroup: C1[X(C9H8O5)]
method: RPBEPBE
basis: SDD
operation: Freq
keyword: #p
keyword: freq=noraman
keyword: PBEPBE/SDD
title: #p freq=noraman PBEPBE/SDD
converged: YES YES NO NO
title: Mulliken charges:
elementType: O O O O O C C C C C C C C C H H H H H H H H
charge: -0.285606 -0.431808 -0.182302 -0.374652 -0.226516 0.360864 0.234994 -0.433258 0.190182 -0.362820 -0.356881 0.029299 -0.519210 0.096289 0.289374 0.278929 0.225021 0.260554 0.216896 0.236187 0.369094 0.385370
chargesum: 0.00000
title: Mulliken charges with hydrogens summed into heavy atoms:
elementType: O O O O O C C C C C C C C C
charge: -0.285606 -0.062714 -0.182302 0.010719 -0.226516 0.360864 0.234994 -0.143884 0.190182 -0.083890 -0.131860 0.029299 0.194427 0.096289
polarizability: 1.82929834e+02 3.37995891e+00 1.26054438e+02 -6.27213103e-01 8.60636335e-01 5.75392948e+01
1716.lowfreq: -5.8995 0.0002 0.0003 0.0009 4.1669 9.7982 33.8260 37.9683 61.5080
frequency: 33.7926 37.9468 61.4761 103.1492 120.3909 128.3491 185.8730 238.5641 258.4914 278.2268 314.2746 344.0892 358.1313 382.2316 391.5324 436.0905 460.3739 549.9192 592.1427 598.5494 609.3971 657.0720 687.4954 729.9352 740.7213 774.5957 819.4901 844.8107 903.6728 933.1867 961.9847 996.2168 1059.9781 1081.8830 1112.6827 1153.3480 1162.1809 1187.7315 1238.4823 1269.1461 1289.4773 1324.8801 1394.4118 1410.5977 1439.3954 1458.3683 1478.3010 1496.9200 1556.2337 1588.9730 1610.2001 1628.5834 2982.8819 3092.7781 3114.0150 3134.2208 3168.2630 3181.5930 3494.9743 3573.4300
redmass: 9.8214 6.8651 2.3655 5.0261 4.6152 1.9195 2.6366 6.6080 5.2723 6.5363 6.1040 4.4501 8.4491 5.1968 1.1759 5.4968 3.1999 5.3325 4.9305 1.7078 4.0576 3.8693 4.2515 3.9292 6.0599 4.0827 1.7004 7.3823 1.6211 7.3393 1.3551 3.9866 2.3510 2.1887 1.2373 1.3311 1.1559 2.0733 2.1528 3.0712 1.4670 3.9660 3.1790 6.2572 1.3243 1.0617 1.0551 3.1422 9.3068 7.0343 7.1297 9.5782 1.0340 1.0984 1.0901 1.1047 1.0944 1.0920 1.0640 1.0661
irintensity: 2.8098 4.9958 3.9969 1.3724 0.7672 3.4621 1.7964 3.8059 9.6451 3.6498 4.2290 7.4288 2.7175 3.2450 139.5584 9.0128 2.4371 7.9955 28.4393 70.2159 112.3503 39.7643 62.2030 1.0667 26.2992 24.2845 23.5676 2.0865 23.8136 187.8395 1.6342 32.4312 308.1248 70.8023 4.8900 19.7685 32.0078 86.9438 112.8332 346.9826 3.2238 52.0945 41.4300 2.2151 8.5993 15.3481 30.6302 48.0529 363.0451 15.3720 51.8290 184.8418 74.5787 33.0335 14.7311 14.4347 3.2868 3.6570 36.2907 67.7644
temp: 298.150 k
press: 1.00000 atm
elementType: 8 8 8 8 8 6 6 6 6 6 6 6 6 6 1 1 1 1 1 1 1 1
symmnumber: 1
zpe: 408022.9 jmol-1
zpe.correction: 0.155408 hartree
zpe.thermalcorrener: 0.168955 hartree
zpe.thermalcorrenthalpy: 0.169899 hartree
zpe.thermalcorrgfe: 0.113892 hartree
zpe.sumelectzpe: -722.824447 hartree
zpe.sumelectthermal: -722.810900 hartree
zpe.sumelectthermalent: -722.809955 hartree
zpe.sumelectthermalfe: -722.865962 hartree
dipole: -4.2692 0.7601 0.0865
dipole: 4.3372
quadrupole: -68.4087 -73.7714 -83.7954
quadrupole: -16.2333 -6.8789 1.0284
quadrupole: 6.9164 1.5537 -8.4702 -16.2333 -6.8789 1.0284
hfenergy: -722.9798543 hartree
pointgroup: C01 [X(C9H8O5)]
dipole: -1.6931404 -0.1894648 -0.0954029 debye
dipolederiv: -0.8968265 0.6371775 -0.0135294 0.7155912 -0.9778218 0.0599513 0.1128528 -0.1554554 -0.347342 -1.6451581 -0.1424256 0.0600258 -0.1097726 -0.1137123 0.0499331 0.0712515 0.0641685 -0.3860667 -1.0660697 0.0712876 0.0513262 0.6073898 -0.5971627 -0.0738889 0.1196952 -0.082513 -0.3075878 -1.0641745 0.0969007 -0.4299515 -0.048442 -0.2126515 -0.0351177 -0.5338889 0.0060494 -0.7172106 -0.6720669 -0.1480811 -0.1406858 -0.0058587 -0.7360228 0.3097582 -0.2327586 0.1121078 -0.5130354 -1.1357628 -0.0376813 0.0161125 -0.1174526 -0.0987649 -0.0176429 -0.0367594 -0.0354821 -0.0295423 0.0549197 -0.5397154 -0.112989 -1.0982932 0.8923337 0.052044 -0.2843721 0.2565473 0.0305783 0.2507627 0.2524427 0.0077601 -0.1995576 -0.0791184 0.0439565 -0.0861495 0.0402008 -0.0909562 1.521732 0.0949111 -0.0889989 0.2294096 -0.0092112 0.0003242 -0.0466934 -0.066348 0.0650092 0.2584184 0.0148261 -0.0139098 0.2571892 -0.0133264 0.0225479 0.0148233 0.0156824 -0.104274 -0.3972093 0.0453815 0.0217408 0.3636239 0.032451 0.0159744 0.085739 0.0313148 -0.1726564 1.8890389 -0.0206979 -0.096065 -0.3696248 0.5974321 0.151778 -0.0554254 0.1502369 0.1898469 0.646431 -0.4016744 0.0835299 -0.171549 0.3424541 -0.0975741 0.1923569 -0.1896719 0.3697921 1.2735092 0.0689019 0.6202091 0.1083427 0.7082552 -0.3786897 0.7568186 -0.2101 0.8205218 0.1461158 -0.0397194 0.00083 -0.0232339 0.0428586 -0.0213706 -0.015879 -0.0128221 0.1484526 0.0972579 0.0720769 0.0135579 0.0205667 0.0363892 -0.0241682 -0.000586 -0.0271691 0.1539263 -0.032948 -0.1138065 -0.011314 -0.086321 -0.0344109 -0.0292946 -0.0026615 -0.0255656 0.1644513 -0.0670708 -0.0224065 -0.0179528 -0.1500747 0.0754957 0.0174564 -0.0321275 0.0523936 0.071373 -0.0152432 0.0494607 0.0768073 0.0146912 0.0734936 0.004013 -0.0532276 0.1269309 -0.1684666 0.062871 0.065766 -0.010975 0.119306 -0.1190635 -0.0559726 0.0020069 -0.0700197 0.0718086 0.4396455 0.0556966 0.002893 0.0340711 0.0722294 -0.0397587 -0.0021122 -0.0476238 0.3783928 0.3518275 -0.0586213 -0.0184214 -0.0900013 0.1178739 0.045741 0.0270969 0.0671383 0.3729851 unknown
polarizability: 182.1732366|-7.1261346|126.201064|3.6154174|5.7485795|58.1492655 unknown
InChI: InChI=1S/C9H8O5/c1-14-7-4-5(2-3-6(7)10)8(11)9(12)13/h2-4,10,12H,1H3
charge 0 multiplicity 1
22 atoms
O  -2.050583 1.815362 0.408302
O  -3.517184 -0.627073 0.014819
O  2.849462 -1.701411 -0.443347
O  4.041987 0.483477 0.851133
O  2.744959 1.758354 -0.595928
C  0.71198 -0.588558 -0.199156
C  -1.428734 0.602599 0.088005
C  -0.021166 0.607266 0.034804
C  -2.121262 -0.633729 -0.09316
C  0.00545 -1.808119 -0.400584
C  -1.394689 -1.824556 -0.350356
C  2.193182 -0.642207 -0.226018
C  -3.203119 2.254372 -0.410753
C  2.979542 0.670159 -0.023005
H  0.482108 1.568653 0.165597
H  0.577792 -2.72196 -0.586022
H  -1.939475 -2.767201 -0.494005
H  -4.056076 1.566682 -0.298083
H  -2.910007 2.328814 -1.47528
H  -3.453704 3.25247 -0.021892
H  -3.883693 -1.541074 -0.086408
H  4.573831 1.324479 0.914837
