program: Gaussian 09
title: 000164926
version: EM64L-G09RevD.01
frameworkgroup: C1[X(C10H16ClN7O)]
method: RPBEPBE
basis: SDD
operation: Freq
keyword: #p
keyword: freq=noraman
keyword: PBEPBE/SDD
title: #p freq=noraman PBEPBE/SDD
converged: YES YES NO NO
title: Mulliken charges:
elementType: Cl O N N N N N N N C C C C C C C C C C H H H H H H H H H H H H H H H H
charge: -0.087885 -0.308228 -0.155984 -0.105985 0.138698 -0.629128 -0.075490 -0.620180 -0.598823 -0.358060 -0.361578 0.411169 -0.671431 -0.674453 -0.448923 0.100510 -0.148662 0.053823 0.260791 0.209720 0.248543 0.250173 0.211614 0.249036 0.222887 0.218718 0.210832 0.253387 0.214795 0.307869 0.383499 0.340012 0.310450 0.335550 0.312735
chargesum: 0.00000
title: Mulliken charges with hydrogens summed into heavy atoms:
elementType: Cl O N N N N N N N C C C C C C C C C C
charge: -0.087885 -0.308228 -0.155984 -0.105985 0.138698 0.062240 -0.075490 0.030282 0.049461 0.100203 0.100208 0.411169 0.019209 0.004560 -0.448923 0.100510 -0.148662 0.053823 0.260791
polarizability: 2.57998739e+02 3.13881106e+00 2.17760465e+02 1.06329105e+01 1.54594463e+00 1.08905887e+02
1716.lowfreq: -5.2916 -4.3085 0.0011 0.0015 0.0023 6.8978 23.0980 40.4679 46.3194
frequency: 22.9262 40.4488 46.3108 54.3136 68.7737 78.3454 109.3523 116.1784 136.6507 160.1013 163.4069 201.7956 205.6771 225.2982 240.8740 259.6680 281.4057 309.5376 315.9408 331.6120 352.1724 363.6767 416.6613 427.0085 448.1751 453.3178 470.3016 498.9362 514.7801 527.6917 541.9744 549.3049 570.1178 612.3329 624.9933 645.6317 665.8793 679.3684 704.6530 729.8052 770.5751 773.9509 774.9245 839.0962 852.8654 918.4026 931.3859 975.1983 1016.4958 1031.0976 1051.6831 1067.3344 1085.5747 1092.2861 1096.6140 1163.5280 1177.2193 1212.3080 1261.7655 1288.8827 1302.9382 1322.1544 1343.6514 1356.4802 1358.7005 1380.3691 1390.5531 1411.7411 1424.4633 1448.5338 1456.3553 1462.5233 1467.9639 1473.5380 1482.0663 1484.5703 1492.0033 1541.3675 1552.9371 1578.3159 1610.4100 1635.5165 1689.5446 2985.2780 2991.1831 3000.1624 3023.5370 3071.1616 3075.7158 3087.9462 3090.7945 3103.8537 3107.1664 3270.4301 3534.5058 3555.7716 3626.5607 3673.7393 3706.6245
redmass: 5.7076 3.6878 3.6961 4.3671 3.9871 3.3260 5.0305 3.2752 4.9790 4.4939 4.7781 1.2950 3.7275 2.6274 1.7194 1.2276 2.0692 3.7756 3.0803 9.7025 8.1358 3.7764 1.5603 2.3060 3.2360 3.1836 3.1957 2.6531 1.4785 1.8386 1.8283 1.5941 3.8424 5.4810 5.7434 5.9703 9.5336 7.5420 9.9882 8.2459 4.2507 1.1654 1.3562 1.1857 2.5164 2.9616 3.4685 3.5676 2.4227 2.1062 1.7182 2.3977 1.8507 2.2045 1.7813 2.5003 2.4529 2.9056 2.6424 3.5248 1.3796 1.9102 1.9641 2.0136 1.4356 1.2349 1.2068 2.7611 3.9365 1.5449 2.9637 1.1417 1.0627 1.1907 1.1421 1.0537 2.0082 3.6425 3.4219 2.7475 1.2767 1.2431 4.7070 1.0359 1.0358 1.0660 1.0620 1.0989 1.1004 1.0977 1.0962 1.1020 1.1023 1.0620 1.0463 1.0455 1.0901 1.1019 1.1045
irintensity: 4.0833 1.1521 1.7596 6.4250 3.2632 1.9916 2.6085 0.6397 6.6136 4.0840 5.3090 0.3539 2.3575 2.6075 0.4030 64.8624 4.4980 15.3046 5.9247 8.4824 6.9287 14.7629 75.2998 36.2444 19.4533 16.4499 45.9704 20.7604 97.7259 174.4901 162.7430 196.4440 13.3289 29.2344 10.9241 14.8327 7.1063 56.3691 7.8450 16.1004 0.6341 3.3101 28.7396 121.7878 10.8950 81.3680 98.6767 45.1141 37.8796 10.9927 13.1036 9.9618 32.1164 81.0951 10.3492 20.5080 44.5806 6.2668 52.5165 367.0242 6.7237 20.3964 100.9627 8.2707 64.8431 23.6749 26.6173 165.7820 32.5022 154.9216 132.9304 30.4293 11.5206 14.8246 16.9502 7.6159 174.7875 521.6378 254.1340 577.1557 172.7670 103.1911 867.9262 30.5170 26.4912 44.1582 62.6418 20.8610 3.1976 42.4000 32.1721 15.6574 36.4473 201.4435 32.7669 56.6222 62.9420 19.0599 35.3753
temp: 298.150 k
press: 1.00000 atm
elementType: 17 8 7 7 7 7 7 7 7 6 6 6 6 6 6 6 6 6 6 1 1 1 1 1 1 1 1 1 1 1 1 1 1 1 1
symmnumber: 1
zpe: 718463.5 jmol-1
zpe.correction: 0.273648 hartree
zpe.thermalcorrener: 0.294156 hartree
zpe.thermalcorrenthalpy: 0.295100 hartree
zpe.thermalcorrgfe: 0.223645 hartree
zpe.sumelectzpe: -1307.795161 hartree
zpe.sumelectthermal: -1307.774653 hartree
zpe.sumelectthermalent: -1307.773709 hartree
zpe.sumelectthermalfe: -1307.845165 hartree
dipole: -3.0928 -3.4114 -1.6736
dipole: 4.8994
quadrupole: -103.9536 -114.5769 -115.8234
quadrupole: -24.3121 -3.8590 -3.5469
quadrupole: 7.4977 -3.1256 -4.3721 -24.3121 -3.8590 -3.5469
hfenergy: -1308.0688095 hartree
pointgroup: C01 [X(C10H16Cl1N7O1)]
dipole: 1.2111731 1.4918578 0.1514585 debye
polarizability: 256.6827984|12.0243314|184.5842864|-13.6275752|49.5634273|143.3980056 unknown
InChI: InChI=1S/C10H16ClN7O/c1-3-18(4-2)8-6(11)15-5(7(12)16-8)9(19)17-10(13)14/h3-4,12-14H2,1-2H3
charge 0 multiplicity 1
35 atoms
Cl 0.623924 2.496142 0.696881
O  -2.863932 -2.333841 -1.412768
N  2.865832 0.474134 -0.769711
N  1.182255 -0.977985 -1.50722
N  -0.791702 0.341937 -0.081264
N  -0.383596 -2.519164 -2.327249
N  -3.449299 -0.693181 0.137655
N  -4.283657 0.981578 1.526274
N  -3.620723 1.577818 -0.642868
C  3.523525 1.27912 0.296782
C  3.775328 -0.236056 -1.710267
C  1.525564 0.128123 -0.771842
C  3.445765 0.640077 1.70105
C  4.414463 -1.513381 -1.124055
C  0.437396 0.814382 -0.0976
C  -0.105881 -1.435073 -1.545889
C  -1.142577 -0.787829 -0.762165
C  -2.5515 -1.290719 -0.719592
C  -3.731771 0.578576 0.322503
H  4.580868 1.377638 -0.006074
H  3.095288 2.294056 0.32708
H  3.190777 -0.50327 -2.604287
H  4.561036 0.48452 -2.007749
H  2.401158 0.56488 2.047439
H  3.890814 -0.370096 1.70811
H  3.994467 1.269525 2.42562
H  5.034441 -1.293804 -0.236147
H  3.62828 -2.23319 -0.841139
H  5.065537 -1.988523 -1.8812
H  0.368666 -2.959536 -2.852964
H  -1.362408 -2.857667 -2.289287
H  -4.348784 0.281636 2.260547
H  -4.816718 1.843298 1.608846
H  -3.208769 1.319698 -1.537143
H  -3.494171 2.545377 -0.349006
