program: Gaussian 09
title: 000164925
version: EM64L-G09RevD.01
frameworkgroup: C1[X(C13H18F3N3O2)]
method: RPBEPBE
basis: SDD
operation: Freq
keyword: #p
keyword: freq=noraman
keyword: PBEPBE/SDD
title: #p freq=noraman PBEPBE/SDD
converged: YES YES NO NO
title: Mulliken charges:
elementType: F F F O O N N N C C C C C C C C C C C C C H H H H H H H H H H H H H H H H H H
charge: -0.167979 -0.163205 -0.163760 -0.190445 -0.199265 -0.214944 -0.005609 -0.676831 -0.385462 -0.348587 0.163969 -0.358535 -0.373585 0.321064 0.385989 0.382693 -0.523661 -0.609051 -0.689139 -0.683108 0.243856 0.248391 0.229953 0.213202 0.222149 0.213963 0.187313 0.204690 0.217151 0.302181 0.263490 0.217723 0.223951 0.210670 0.215177 0.222179 0.212750 0.311152 0.339511
chargesum: 0.00000
title: Mulliken charges with hydrogens summed into heavy atoms:
elementType: F F F O O N N N C C C C C C C C C C C C C
charge: -0.167979 -0.163205 -0.163760 -0.190445 -0.199265 -0.214944 -0.005609 -0.026168 0.092883 0.086763 0.163969 0.042741 0.048256 0.321064 0.385989 0.382693 -0.221480 -0.345561 -0.036794 -0.033003 0.243856
polarizability: 2.42613074e+02 -7.93688163e+00 1.84924319e+02 -1.91937601e+00 -1.71667096e+01 1.32574466e+02
1716.lowfreq: -20.8783 -7.9388 -0.0010 -0.0009 -0.0007 4.5529 5.7762 28.4928 42.9964
frequency: -20.7858 28.4297 42.9317 52.4678 59.9122 63.1201 90.5234 102.2306 109.6788 115.4016 128.3670 165.8417 199.8015 211.4134 215.4020 226.5679 230.0233 239.2553 258.2857 286.4751 301.0306 303.3522 332.1778 368.0303 387.8423 393.3815 430.3243 435.6918 464.1444 489.7532 506.2089 525.2040 545.4020 596.0490 614.8608 625.3708 644.2781 690.8883 704.2696 730.5181 743.7875 752.2077 760.4030 833.7910 857.4189 868.4731 877.0340 884.1791 888.6135 900.3511 950.1398 968.9220 987.0756 1021.6583 1039.9143 1044.3449 1051.9663 1091.1925 1094.3080 1102.8160 1117.8623 1135.4748 1164.7489 1194.0431 1205.5618 1231.7895 1242.1370 1258.0211 1275.0648 1283.9321 1300.9385 1308.1855 1329.3709 1350.8369 1359.5636 1368.4090 1377.1507 1392.2271 1394.8137 1404.1639 1451.4960 1454.3107 1468.8091 1475.3362 1477.1242 1478.4723 1479.1483 1487.1306 1490.6704 1502.2342 1568.5870 1591.1909 1625.8283 2947.3982 2971.2490 2971.5199 2977.9777 2978.5859 2992.8914 3017.9246 3032.2217 3041.9996 3055.1664 3074.9551 3077.2721 3080.2575 3081.5043 3158.3201 3185.9265 3506.5028 3676.3386
redmass: 15.6402 4.6162 4.1385 6.2412 2.8575 2.4536 2.8464 2.9065 7.2752 2.1808 6.7928 3.7484 5.1087 2.0769 2.9194 1.7078 1.2762 3.5208 3.6160 5.4710 3.7781 4.2091 9.0778 5.8920 3.9816 5.0118 1.5957 2.6822 7.7037 7.7861 4.8052 4.0251 6.5216 1.2653 5.4075 5.1295 4.1474 7.0383 8.9746 2.1875 1.5928 2.8302 1.3491 4.4327 1.4843 1.6698 1.5399 1.5539 1.5630 1.7467 6.4730 2.5256 11.7050 3.1468 3.1487 3.4167 2.8302 1.9981 2.4666 1.9893 2.1842 2.1918 2.3271 2.3811 6.9456 1.7713 1.2959 1.8694 1.3137 1.1354 1.3557 1.3161 2.3806 3.1593 1.3092 3.1482 1.5386 1.2188 1.2282 5.9619 3.5709 1.1350 1.0808 1.0543 1.0675 1.0453 1.0441 1.0849 1.0898 4.8873 3.8008 1.7240 3.6816 1.0654 1.0618 1.0605 1.0366 1.0363 1.0608 1.0951 1.0976 1.1005 1.1017 1.1010 1.1017 1.0993 1.0993 1.0918 1.0929 1.0471 1.1007
irintensity: 0.0115 0.0163 1.5303 0.2378 0.6952 0.2228 0.5642 2.3123 1.3017 0.1800 0.8405 2.6958 0.2616 0.1787 1.0606 1.2311 0.2533 5.3540 2.3095 2.6627 1.1176 4.6611 4.1383 13.2351 7.6397 9.6843 112.0368 33.4682 3.3152 1.5761 1.2223 18.9694 1.5481 112.7511 12.8465 9.3661 4.9439 9.2774 13.6955 7.5412 8.9666 7.0324 9.0417 37.3104 10.6591 1.9087 22.9125 60.6684 24.6921 10.6306 87.7035 19.6314 212.0624 44.8729 2.1034 104.7916 4.6813 15.0466 56.9986 20.0821 3.4291 120.1439 12.6064 81.8385 279.0384 111.5544 7.5173 98.4027 2.0461 0.9108 2.8642 5.0817 98.0189 151.8499 3.8460 31.1979 44.9952 23.7065 20.2212 46.4583 63.1655 3.2820 1.8514 1.9471 4.4657 8.6965 17.9487 23.9265 11.7097 72.6143 4.8497 97.4850 154.7500 15.9154 11.3628 61.0483 40.0022 27.9395 34.9466 1.1432 0.1327 17.5459 5.2081 44.1452 88.1950 27.3836 59.8070 2.3602 10.0033 45.2331 56.1851
temp: 298.150 k
press: 1.00000 atm
elementType: 9 9 9 8 8 7 7 7 6 6 6 6 6 6 6 6 6 6 6 6 6 1 1 1 1 1 1 1 1 1 1 1 1 1 1 1 1 1 1
symmnumber: 1
zpe: 793759.0 jmol-1
zpe.correction: 0.302327 hartree
zpe.thermalcorrener: 0.323761 hartree
zpe.thermalcorrenthalpy: 0.324705 hartree
zpe.thermalcorrgfe: 0.251415 hartree
zpe.sumelectzpe: -1118.723723 hartree
zpe.sumelectthermal: -1118.702288 hartree
zpe.sumelectthermalent: -1118.701344 hartree
zpe.sumelectthermalfe: -1118.774634 hartree
dipole: 5.2884 -4.9569 2.6402
dipole: 7.7142
quadrupole: -133.8244 -124.3598 -126.0437
quadrupole: -2.0671 2.6430 1.0961
quadrupole: -5.7484 3.7161 2.0323 -2.0671 2.6430 1.0961
hfenergy: -1119.0260495 hartree
pointgroup: C01 [X(C13H18F3N3O2)]
dipole: 2.0387655 -2.1188918 -0.7516591 debye
polarizability: 242.6168466|-6.9732678|171.5831677|-3.0678372|28.6948101|145.9118452 unknown
InChI: InChI=1S/C13H18F3N3O2/c1-3-5-18(6-4-2)12-10(17)7-9(13(14,15)16)8-11(12)19(20)21/h7-8H,3-6,17H2,1-2H3
charge 0 multiplicity 1
39 atoms
F  -4.530853 -1.426416 -0.892765
F  -4.58492 -0.258351 1.051465
F  -4.554591 0.842941 -0.9222
O  -0.464882 2.83505 1.705519
O  1.278902 2.5117 0.277833
N  1.769844 -0.323509 -0.013297
N  0.168211 2.134375 0.824134
N  0.401655 -2.401248 -1.152335
C  2.506213 -0.023604 -1.283311
C  2.448284 0.050982 1.257577
C  0.350105 -0.213461 -0.105702
C  3.852494 -0.759007 -1.438757
C  3.158047 -1.147591 1.933563
C  -0.448619 0.863258 0.374445
C  -0.350501 -1.333696 -0.691369
C  -2.506157 -0.26258 -0.214134
C  -1.860712 0.845641 0.36549
C  -1.766865 -1.338571 -0.748359
C  4.499195 -0.445239 -2.805484
C  3.834771 -0.730179 3.257683
C  -4.00655 -0.282341 -0.247724
H  2.671531 1.07363 -1.346763
H  1.843705 -0.300814 -2.125341
H  1.702705 0.442744 1.973547
H  3.167029 0.874997 1.072737
H  4.544457 -0.457683 -0.6293
H  3.698987 -1.85272 -1.335689
H  2.407724 -1.939787 2.123199
H  3.908782 -1.578574 1.245731
H  -2.41455 1.694825 0.772211
H  -2.291332 -2.201903 -1.169575
H  4.673079 0.640594 -2.923123
H  5.473171 -0.955327 -2.911366
H  3.851997 -0.77424 -3.639968
H  3.09646 -0.322909 3.973735
H  4.330492 -1.591776 3.739634
H  4.601852 0.04887 3.088588
H  -0.042961 -3.242219 -1.508914
H  1.391103 -2.414361 -0.900414
