program: Gaussian 09
title: 000164933
version: EM64L-G09RevD.01
frameworkgroup: C1[X(C10H12N4O7)]
method: RPBEPBE
basis: SDD
operation: Freq
keyword: #p
keyword: freq=noraman
keyword: PBEPBE/SDD
title: #p freq=noraman PBEPBE/SDD
converged: YES YES NO NO
title: Mulliken charges:
elementType: O O O O O O O N N N N C C C C C C C C C C H H H H H H H H H H H H
charge: -0.267220 -0.467092 -0.442527 -0.433532 -0.278379 -0.240912 -0.216032 -0.196693 -0.458172 -0.410713 -0.416893 -0.003263 -0.289639 -0.132683 -0.072326 -0.343048 0.384650 0.246666 0.122600 0.111102 0.134033 0.204972 0.325138 0.229872 0.282306 0.228520 0.217468 0.375917 0.364954 0.359039 0.370068 0.357952 0.353869
chargesum: 0.00000
title: Mulliken charges with hydrogens summed into heavy atoms:
elementType: O O O O O O O N N N N C C C C C C C C C C
charge: -0.267220 -0.091175 -0.077573 -0.079663 -0.278379 -0.240912 -0.216032 -0.196693 -0.099133 -0.040645 -0.058941 0.201708 0.035499 0.097188 0.209980 0.102940 0.384650 0.246666 0.122600 0.111102 0.134033
polarizability: 2.03119726e+02 -3.30572028e+00 1.72136879e+02 -6.55863129e+00 1.44963029e+01 1.06856373e+02
1716.lowfreq: -10.5464 -4.0191 -0.0006 -0.0003 0.0006 3.5129 21.7081 35.7595 52.9542
frequency: 21.4669 35.7420 52.9439 67.9566 110.6453 120.0539 129.1646 148.3952 164.0859 175.0395 195.6047 208.3506 215.7953 259.8385 269.8401 298.9706 318.8057 349.0692 354.5689 378.8549 407.8748 434.7196 445.1997 464.6678 502.3371 533.5395 538.4792 541.3168 570.4346 574.8673 579.3367 615.0469 650.1429 678.3899 689.3950 706.7819 709.1059 713.3661 749.1240 759.4473 790.5439 819.0966 877.1209 919.6767 943.3506 959.2487 979.5023 985.6911 1005.9057 1021.6707 1039.1121 1053.5147 1076.6749 1089.1316 1141.1615 1168.7855 1177.0951 1186.3712 1209.9448 1228.4249 1241.9256 1250.4893 1261.4563 1282.7956 1298.4695 1304.1262 1310.9073 1320.9225 1342.0705 1353.6920 1363.0827 1379.4213 1389.8305 1401.4128 1437.1399 1461.3229 1524.1470 1601.7954 1639.7136 1682.1496 1722.0205 2981.3658 2988.2292 3010.5475 3066.0148 3080.6873 3089.0258 3470.7390 3523.2919 3549.0678 3610.5140 3619.2751 3619.9743
redmass: 7.7578 8.0589 7.0102 7.0999 7.6010 3.8470 5.7156 7.7987 6.5824 6.5757 5.5987 5.0244 1.6208 5.8590 4.1122 3.9749 8.7076 7.3514 6.4546 4.6898 6.8615 1.4566 4.1911 5.6984 2.1868 2.0681 1.4102 2.4785 5.3388 1.2509 6.9291 2.3625 5.1661 5.0415 3.3386 10.5402 5.7687 4.7886 6.4479 2.1749 4.4940 4.4997 3.8247 5.7914 4.0135 2.7013 3.4012 4.6899 3.5950 2.6984 4.3878 5.0709 2.4201 3.4531 3.1671 3.4159 1.3846 1.2701 1.4003 3.3243 1.2131 1.3189 5.4206 1.3928 1.4011 1.5135 1.9005 1.3066 1.1994 1.3522 1.6400 1.4295 1.3700 1.3974 6.8575 1.0864 6.7108 6.7240 9.0389 7.3808 8.6676 1.0698 1.0808 1.0834 1.0907 1.0959 1.0880 1.0645 1.0770 1.0654 1.0814 1.0678 1.0813
irintensity: 1.0422 0.6143 4.3985 1.8789 1.1239 5.3023 1.4853 0.0733 8.2741 0.3933 8.7252 23.5312 35.7940 12.1447 1.0778 10.2884 0.2724 3.8242 11.4632 4.3929 7.0828 74.4741 90.1070 19.8301 55.3569 77.1044 77.5768 74.4060 6.9937 107.7058 23.6106 42.9463 14.3252 30.7950 37.8725 11.6869 3.1908 24.9772 5.4678 117.4113 51.0292 16.1817 23.4467 32.0089 81.7198 49.7715 184.6253 49.8029 80.5838 11.6094 85.5405 8.0759 24.8084 5.6362 43.6559 9.6523 13.9757 39.4612 17.1456 25.7570 0.9832 5.6795 121.6740 67.9551 37.4311 6.8350 96.2082 13.7960 27.3853 25.8200 72.0294 5.8742 15.9171 12.5807 51.2155 24.0062 178.7661 51.0461 528.5375 845.4928 696.3516 8.9959 67.7639 29.8048 4.1547 35.6212 3.5346 27.5142 78.0364 7.0544 88.8212 35.5194 107.0807
temp: 298.150 k
press: 1.00000 atm
elementType: 8 8 8 8 8 8 8 7 7 7 7 6 6 6 6 6 6 6 6 6 6 1 1 1 1 1 1 1 1 1 1 1 1
symmnumber: 1
zpe: 631558.9 jmol-1
zpe.correction: 0.240548 hartree
zpe.thermalcorrener: 0.259547 hartree
zpe.thermalcorrenthalpy: 0.260492 hartree
zpe.thermalcorrgfe: 0.192619 hartree
zpe.sumelectzpe: -1132.293091 hartree
zpe.sumelectthermal: -1132.274092 hartree
zpe.sumelectthermalent: -1132.273148 hartree
zpe.sumelectthermalfe: -1132.341020 hartree
dipole: -2.1545 -0.7869 5.0929
dipole: 5.5856
quadrupole: -141.2950 -139.9035 -118.4858
quadrupole: 6.5381 -12.3327 -3.8423
quadrupole: -8.0669 -6.6754 14.7423 6.5381 -12.3327 -3.8423
hfenergy: -1132.5336393 hartree
pointgroup: C01 [X(C10H12N4O7)]
dipole: -0.5961661 0.8530896 -1.9354563 debye
polarizability: 200.5997917|-4.8478813|161.9667484|17.3681242|26.6460408|119.546439 unknown
InChI: InChI=1S/C10H12N4O7/c15-1-2-4(16)5(17)8(21-2)14-6-3(11-9(19)12-6)7(18)13-10(14)20/h2,4-5,8,11-13,15-17H,1H2
charge 0 multiplicity 1
33 atoms
O  -1.778141 0.051594 0.968457
O  -1.345192 2.287502 -1.845688
O  -3.299003 2.585845 -0.054433
O  -3.673916 -2.025965 1.425487
O  -0.96616 -1.750706 -1.502193
O  3.566817 -2.682401 -0.737299
O  3.868151 2.046022 2.110126
N  0.258964 -0.138158 -0.285265
N  1.846651 1.280934 1.043455
N  1.296542 -2.138466 -1.085538
N  3.672844 0.004773 0.844643
C  -0.926486 0.699905 -0.027924
C  -1.818457 1.029288 -1.253441
C  -3.214001 1.230739 -0.595516
C  -3.228594 0.241609 0.578815
C  -3.817629 -1.141849 0.268871
C  1.492541 0.173365 0.286783
C  0.126648 -1.374303 -0.990365
C  2.622676 -0.62949 0.157102
C  2.610254 -1.875672 -0.557956
C  3.239552 1.208221 1.424463
H  -0.559741 1.667318 0.366016
H  -1.832142 0.19905 -1.97572
H  -4.036273 1.043532 -1.315444
H  -3.723572 0.689992 1.456125
H  -3.331807 -1.578959 -0.627205
H  -4.904883 -1.05601 0.099291
H  -1.286508 2.209443 -2.827966
H  -2.822045 3.181714 -0.695847
H  1.259611 2.051101 1.358344
H  1.191381 -3.01924 -1.60012
H  4.622039 -0.354496 0.925538
H  -2.708821 -2.057632 1.653803
