program: Gaussian 09
title: 000164961
version: EM64L-G09RevD.01
frameworkgroup: C1[X(C21H30O4)]
method: RPBEPBE
basis: SDD
operation: Freq
keyword: #pfreq=noraman
keyword: PBEPBE/SDD
title: #p freq=noraman PBEPBE/SDD
converged: YES YES NO NO
title: Mulliken charges:
elementType: O O O O C C C C C C C C C C C C C C C C C C C C C H H H H H H H H H H H H H H H H H H H H H H H H H H H H H H
charge: -0.456122 -0.240493 -0.239292 -0.444095 -0.107651 0.381084 -0.149935 -0.139396 0.249480 -0.232685 -0.537323 -0.533439 -0.557452 -0.479822 -0.474078 0.581636 -0.822694 -0.650822 -0.497704 -0.469630 0.085883 -0.543356 -0.589328 0.186392 -0.383313 0.215310 0.221466 0.210919 0.240532 0.204219 0.213859 0.217374 0.236728 0.215608 0.237489 0.226614 0.217233 0.262522 0.216021 0.250693 0.230192 0.221841 0.225046 0.235540 0.217360 0.205709 0.211149 0.202732 0.231562 0.264194 0.251988 0.239109 0.225556 0.349787 0.365803
chargesum: 0.00000
title: Mulliken charges with hydrogens summed into heavy atoms:
elementType: O O O O C C C C C C C C C C C C C C C C C C C C C
charge: -0.106335 -0.240493 -0.239292 -0.078292 0.107660 0.381084 0.071531 0.071523 0.249480 0.007847 -0.119245 -0.079337 -0.104355 -0.035975 0.004464 0.581636 -0.119968 -0.190237 -0.074635 -0.055750 0.085883 -0.047601 -0.337340 0.186392 0.081352
polarizability: 3.03361948e+02 -4.28635483e+00 2.10504452e+02 -1.99304302e+01 3.77882537e+00 1.86596753e+02
1716.lowfreq: -8.2273 -0.0008 -0.0005 0.0003 10.4167 12.4846 29.9879 39.0021 50.5753
frequency: 29.8727 38.8880 50.4554 55.0890 74.7694 82.4290 105.8846 126.3289 146.5852 159.9139 168.9479 189.4801 193.1803 202.6664 216.1237 220.3054 228.6948 254.5481 260.7139 277.3742 286.2726 307.5186 317.0331 332.9940 361.8122 368.1913 372.2488 404.7179 410.6694 419.5216 426.2011 452.4033 463.8402 492.2143 503.2549 528.9416 530.8938 553.8433 588.1877 614.5107 635.5924 651.2569 679.3468 681.1792 725.7723 744.4833 776.4186 810.2538 820.2218 830.6946 845.1358 858.3710 887.3985 897.0012 904.7260 920.9213 928.6127 938.0703 948.2520 962.8972 971.7046 979.9997 997.8271 1002.6876 1008.1429 1014.0573 1026.5668 1032.8523 1038.8992 1044.6746 1054.1118 1077.3196 1092.3757 1094.3037 1109.9116 1110.1821 1121.7124 1126.0275 1132.5372 1160.0945 1173.0512 1178.5344 1182.7759 1184.0074 1194.4342 1204.9110 1209.4066 1217.4550 1223.5409 1234.6405 1241.7196 1248.6223 1253.4052 1260.6015 1271.6966 1279.5725 1283.4459 1285.2726 1296.0732 1305.0216 1316.2978 1320.9491 1328.5509 1331.2253 1335.7500 1341.0764 1347.6133 1350.6291 1354.8419 1355.3211 1373.2491 1387.2984 1402.7833 1406.0099 1433.4087 1445.5946 1458.0287 1460.2553 1465.2166 1467.0980 1468.6813 1472.6298 1477.5490 1484.4385 1492.0323 1493.2601 1586.7712 1604.0709 1637.7147 2912.5700 2924.4057 2938.4427 2946.4347 2955.5067 2959.0410 2960.1753 2970.7761 2972.6118 2975.1821 2989.3160 2992.2633 2993.7276 2995.9504 3000.5949 3001.8236 3016.6123 3019.5417 3036.1874 3037.3233 3044.3253 3051.9211 3055.5790 3071.9217 3078.4657 3081.6596 3096.5753 3117.3166 3410.1282 3570.0523
redmass: 6.2927 5.6117 5.0873 5.2524 4.8386 4.0178 3.0845 3.4190 2.0812 3.6453 3.1479 2.7990 2.9765 2.7365 2.9439 1.7955 3.3330 1.1762 1.9242 2.5800 3.1341 2.7641 4.3821 3.4800 2.5671 3.6498 3.3572 2.0939 2.8720 1.9104 3.5699 3.5089 2.1355 2.2611 3.2619 2.7936 2.5211 2.9508 2.9340 3.4734 2.7357 3.9110 3.0863 2.9407 3.5785 3.1604 2.0512 2.2399 2.2278 1.6769 2.1820 2.2716 1.5435 2.5165 2.2252 1.9638 1.7912 2.5449 1.8941 2.2930 2.4738 4.8914 2.6638 2.3586 2.4853 2.5854 1.9438 1.8688 2.9435 2.6618 2.1241 2.6747 2.3471 1.8418 1.6926 2.4470 2.1965 2.1395 1.6856 2.1963 1.7601 1.5190 1.1903 1.6037 1.3235 1.5376 1.4711 1.2316 1.5292 1.4568 1.3195 1.3633 1.4017 1.3351 1.4922 1.4852 1.4493 1.6808 1.3937 1.3851 1.3869 1.4334 1.3589 1.3878 1.4224 1.5847 1.9315 1.6249 1.4522 1.3711 1.4213 1.4380 1.2005 1.3126 1.0884 1.0770 1.0765 1.0889 1.0895 1.0837 1.0887 1.0748 1.0732 1.0752 1.0628 1.0805 9.7589 6.9965 8.0035 1.0808 1.0809 1.0647 1.0557 1.0609 1.0699 1.0731 1.0658 1.0626 1.0818 1.0629 1.0928 1.0543 1.0535 1.0805 1.0812 1.0635 1.0946 1.0978 1.0974 1.0972 1.1000 1.1000 1.1012 1.0983 1.1034 1.0985 1.0913 1.0640 1.0666
irintensity: 4.7881 1.1467 2.6224 0.5437 2.2857 2.3399 3.1901 4.7156 0.3417 0.6871 2.3085 2.9412 8.1466 1.0845 1.6942 1.2510 2.1438 106.6590 20.7422 0.3506 1.5651 1.1385 17.3523 14.8223 4.3712 9.0588 2.5058 45.4859 0.7059 35.9634 0.5203 6.6514 26.9513 6.1048 10.7238 0.0196 0.3940 2.0881 9.9437 2.1708 2.1632 1.2008 24.8778 4.7532 0.7888 0.7019 8.0586 0.4158 2.2278 5.5756 15.5068 11.3362 27.7070 36.8197 11.0644 1.5120 2.9178 1.3252 5.5123 2.1190 12.1579 49.7059 21.7152 23.0558 46.7881 2.8660 4.4565 3.9293 61.3324 2.7766 10.3618 9.3318 2.2486 3.3858 18.5963 1.2691 10.1977 12.6907 9.0086 1.0681 1.5608 7.8474 2.9858 3.6294 11.7020 29.1299 49.2692 11.1005 15.3606 1.5362 2.9623 105.6397 3.9777 32.5011 5.4595 7.7157 12.1131 17.2550 7.1082 0.2189 4.9353 4.0467 4.0320 3.3868 19.4174 24.4274 9.9746 11.0495 11.7107 1.1422 36.2526 38.9580 27.0219 1.0147 18.1956 12.8881 2.5129 5.8897 19.0506 6.6429 4.4886 15.0577 3.1750 3.5141 7.5501 7.1799 194.7226 79.4792 152.4567 8.7275 9.6400 34.0343 54.5448 35.6365 25.7295 7.0160 35.7060 41.8423 37.6086 8.4658 23.6510 13.7195 37.7939 43.7908 17.1103 37.3646 43.4713 50.7603 40.9722 34.4374 37.9299 19.7470 14.4191 28.7015 38.8500 21.4353 11.0051 26.0937 5.8962
temp: 298.150 k
press: 1.00000 atm
elementType: 8 8 8 8 6 6 6 6 6 6 6 6 6 6 6 6 6 6 6 6 6 6 6 6 6 1 1 1 1 1 1 1 1 1 1 1 1 1 1 1 1 1 1 1 1 1 1 1 1 1 1 1 1 1 1
symmnumber: 1
zpe: 1236717.9 jmol-1
zpe.correction: 0.471041 hartree
zpe.thermalcorrener: 0.495157 hartree
zpe.thermalcorrenthalpy: 0.496101 hartree
zpe.thermalcorrgfe: 0.418540 hartree
zpe.sumelectzpe: -1117.174420 hartree
zpe.sumelectthermal: -1117.150304 hartree
zpe.sumelectthermalent: -1117.149360 hartree
zpe.sumelectthermalfe: -1117.226922 hartree
dipole: -2.1437 1.8690 2.4144
dipole: 3.7307
quadrupole: -227.1398 -149.9675 -143.6087
quadrupole: -7.2657 25.1491 -4.1758
quadrupole: -53.5677 23.6045 29.9633 -7.2657 25.1491 -4.1758
hfenergy: -1117.6454612 hartree
pointgroup: C01 [X(C21H30O4)]
dipole: 0.8545208 0.657463 -0.9959176 debye
polarizability: 303.4947081|1.6109961|209.8220675|-20.0510936|-5.0648364|187.1463772 unknown
InChI: InChI=1S/C21H30O4/c1-20-8-7-17-15(16(20)4-5-18(20)19(25)11-22)3-2-13-10-14(24)6-9-21(13,17)12-23/h10,15-18,22-23H,2-9,11-12H2,1H3
charge 0 multiplicity 1
55 atoms
O  -3.73473 -0.656185 -2.309685
O  5.481376 -0.032198 -0.748152
O  -6.086943 -0.40208 1.743996
O  6.280803 -2.282227 0.465946
C  1.271042 1.155026 0.294814
C  2.191885 -0.047897 -0.096574
C  -0.146932 1.066758 -0.308826
C  -0.808653 -0.268777 0.169298
C  -2.309886 -0.46043 -0.315748
C  3.515351 0.404902 0.655628
C  1.534465 -1.345365 0.430945
C  0.093829 -1.502666 -0.126238
C  2.141125 2.402761 0.012838
C  -1.012254 2.278088 0.106311
C  3.592358 1.946779 0.387598
C  -3.090625 0.817935 0.038152
C  2.452139 -0.143477 -1.623443
C  -2.470976 2.133239 -0.392263
C  -2.914353 -1.699159 0.421507
C  -2.334191 -0.674193 -1.857361
C  4.756992 -0.355042 0.239438
C  -4.456635 -1.727131 0.480753
C  -4.277541 0.797709 0.720752
C  -5.017115 -0.435319 1.060469
C  5.156632 -1.589708 1.052558
H  1.141927 1.092234 1.401127
H  -0.064893 1.070083 -1.416639
H  -0.877813 -0.1833 1.278662
H  3.340436 0.213212 1.73488
H  1.493593 -1.311649 1.540333
H  2.127224 -2.239461 0.15247
H  0.151453 -1.685435 -1.216113
H  -0.35703 -2.408424 0.31849
H  1.820137 3.279109 0.602389
H  2.080459 2.688162 -1.054525
H  -0.574839 3.21281 -0.292872
H  -1.01108 2.364878 1.212596
H  4.306054 2.144258 -0.430562
H  3.966627 2.472679 1.283554
H  3.017351 0.723964 -2.003024
H  3.046984 -1.043924 -1.861461
H  1.510459 -0.20967 -2.193782
H  -2.473976 2.187457 -1.50162
H  -3.088757 2.976376 -0.034159
H  -2.522539 -1.705912 1.459276
H  -2.554164 -2.627424 -0.060839
H  -1.868244 -1.652135 -2.09791
H  -1.758631 0.125622 -2.36832
H  -4.822164 -2.579294 1.080621
H  -4.86146 -1.825903 -0.544191
H  -4.768571 1.737795 1.005282
H  4.290627 -2.278437 1.130864
H  5.401899 -1.251732 2.084442
H  -3.766472 -0.778495 -3.291345
H  6.595742 -1.714887 -0.295736
