program: Gaussian 09
title: 000012943
version: EM64L-G09RevD.01
frameworkgroup: C1[X(C20H34O5)]
method: RPBEPBE
basis: SDD
operation: Freq
keyword: #pfreq=noraman
keyword: PBEPBE/SDD
title: #p freq=noraman PBEPBE/SDD
converged: YES YES NO NO
title: Mulliken charges:
elementType: O O O O O C C C C C C C C C C C C C C C C C C C C H H H H H H H H H H H H H H H H H H H H H H H H H H H H H H H H H H
charge: -0.427640 -0.178446 -0.444795 -0.424945 -0.232856 -0.175088 -0.223435 -0.129024 -0.538236 -0.409576 0.087404 -0.406520 -0.199529 -0.388236 -0.264180 -0.400774 -0.157709 -0.409632 -0.383788 -0.363432 -0.484447 -0.350498 -0.337574 0.185570 -0.708289 0.241995 0.253651 0.202049 0.259900 0.246501 0.207214 0.205785 0.196418 0.248336 0.239786 0.203679 0.183088 0.341721 0.264287 0.193145 0.209174 0.185402 0.221665 0.210689 0.214868 0.227673 0.187311 0.195769 0.190920 0.190223 0.249843 0.258415 0.341451 0.191891 0.176261 0.206298 0.207385 0.238214 0.374667
chargesum: 0.00000
title: Mulliken charges with hydrogens summed into heavy atoms:
elementType: O O O O O C C C C C C C C C C C C C C C C C C C C
charge: -0.085919 -0.178446 -0.103345 -0.050278 -0.232856 0.066907 0.030216 0.073025 -0.031835 0.003423 0.087404 0.038233 0.040257 -0.001468 0.000107 0.001545 0.027693 0.022722 0.058752 0.019647 0.023812 0.030645 0.030578 0.185570 -0.056391
polarizability: 2.59844721e+02 -1.07835187e+01 2.56014403e+02 5.70511654e+00 -3.58870619e+00 1.82437110e+02
1716.lowfreq: -5.9529 -1.2945 -0.0006 0.0003 0.0007 6.8987 12.0286 14.8521 18.4075
frequency: 10.2861 14.1835 17.4201 26.0014 33.3463 41.7381 52.2642 52.8140 63.2481 71.3141 78.4591 81.9225 95.8696 106.0190 111.4438 119.1808 131.2350 141.9283 151.4312 179.1200 200.4268 210.3892 232.9111 246.8307 257.2561 262.4383 277.3189 279.7060 293.7173 306.9707 342.7751 355.4158 359.0061 402.3192 413.2834 423.2699 452.6320 465.5888 476.8702 489.7606 503.4132 511.3460 539.7439 544.0886 587.6085 613.1191 626.3650 642.3636 718.1743 729.4728 733.6970 755.7405 770.5783 807.0567 824.7158 833.4058 851.3139 866.0671 882.4745 889.3741 895.5226 932.0563 943.6556 966.9269 970.4859 980.4145 986.0918 996.4766 1002.4946 1016.6528 1019.4492 1037.6299 1040.4528 1047.6928 1058.2267 1068.0521 1073.9923 1081.4629 1093.3496 1104.4663 1109.4582 1110.6555 1115.2284 1129.7262 1139.9692 1151.2839 1162.7573 1171.3944 1181.1379 1190.3159 1205.4980 1221.3126 1225.7738 1229.8162 1240.4176 1245.8684 1249.3786 1255.1478 1263.8009 1269.1122 1276.3797 1278.8641 1283.4582 1285.1798 1288.5358 1295.6686 1298.8574 1300.8903 1303.5824 1313.7229 1317.4153 1334.4756 1337.3172 1348.1247 1350.3998 1356.6987 1360.9989 1367.8906 1371.9832 1385.1029 1388.8791 1427.4444 1439.2150 1459.9694 1462.9384 1463.9418 1465.2296 1469.0420 1470.9139 1478.8910 1480.6686 1483.8713 1485.6695 1487.7886 1654.2442 1667.9664 1678.4945 2923.6029 2932.3686 2945.3261 2948.7546 2952.1942 2953.5754 2961.4864 2962.0451 2965.5206 2971.2576 2972.0932 2986.3521 2987.1424 2987.8181 2990.3819 2994.3514 2999.2034 3000.2870 3005.1198 3014.0522 3024.7345 3027.2596 3037.3251 3048.9578 3051.2279 3052.2144 3064.9294 3065.9911 3070.2438 3077.0394 3090.5763 3508.2043 3548.8897 3564.5729
redmass: 7.9163 5.6458 6.0029 4.7321 5.9591 4.3088 3.9654 2.3655 4.1378 2.7688 2.7965 2.7421 3.2713 2.2985 3.3213 2.0248 3.0765 2.3476 3.4205 3.8459 3.1944 2.8343 2.7460 1.1100 3.6846 3.0097 2.0217 3.8744 1.4268 3.2049 2.1591 1.7207 1.9742 3.2081 3.2467 3.8929 3.5665 2.7245 3.3823 3.1388 2.8666 1.9855 4.2051 2.7483 4.0332 3.4851 3.3507 1.3565 1.2101 1.0735 1.6302 1.1345 1.7422 1.6292 1.6393 1.6797 2.0280 2.0837 2.8245 2.0679 2.0688 1.6242 4.8663 1.8805 2.3122 1.1268 2.0748 2.7452 2.5606 2.9824 2.4821 2.1037 2.0490 2.3110 2.6460 2.2401 2.5213 2.0557 2.4068 1.7444 2.4054 2.3163 2.3008 1.5482 1.7906 1.8033 1.4934 1.6543 1.4366 1.4861 1.3323 1.3374 1.4194 1.4729 1.5056 1.2674 1.3475 1.2802 1.2717 1.2946 1.3391 1.2223 1.1645 1.1557 1.1685 1.2691 1.2082 1.1523 1.2677 1.5081 1.3269 1.4089 1.4227 1.5289 1.4532 1.6499 1.5491 1.7227 1.5503 1.5703 1.2183 1.1032 1.0837 1.0791 1.0763 1.0698 1.0832 1.0755 1.0757 1.0878 1.0744 1.0493 1.0965 1.0822 11.9119 8.1786 6.8202 1.0795 1.0839 1.0844 1.0597 1.0592 1.0609 1.0598 1.0597 1.0630 1.0645 1.0359 1.0608 1.0811 1.0758 1.0725 1.0746 1.1005 1.0644 1.0927 1.0996 1.0978 1.1042 1.0968 1.0903 1.1023 1.1034 1.1011 1.1004 1.0987 1.0995 1.0902 1.0639 1.0661 1.0663
irintensity: 0.7591 0.2792 0.2729 0.3898 1.4956 0.9406 0.3294 0.0776 0.7300 0.3105 0.5159 0.3854 6.4066 0.7309 1.4701 0.6458 0.8387 0.2835 1.4093 0.3764 1.2312 3.0771 3.1766 0.5404 4.2998 3.7330 29.6166 13.3848 83.3786 19.4177 24.7522 58.6391 74.8591 0.2936 8.1250 16.3676 6.0901 0.8935 22.5041 0.7348 10.0391 23.9415 7.6438 2.0602 25.2455 15.4298 0.8224 137.9014 24.3852 11.8567 9.6607 0.5062 3.8995 5.9636 1.5889 2.2833 3.3422 6.9764 4.9442 9.0363 18.2107 0.3829 75.4440 7.6554 9.2600 74.2196 4.4258 11.9129 62.3017 9.5012 55.4746 68.6015 67.4046 54.3942 9.8413 56.3913 2.5206 3.0157 2.2238 10.5158 1.1410 18.6281 27.2241 6.6454 14.6621 43.2209 20.8650 12.8136 9.0919 8.2147 2.4577 32.3029 18.1104 6.8991 3.5944 12.1139 22.8586 15.7821 1.9880 8.9009 11.9718 0.8586 5.6969 0.9892 1.9382 19.1795 5.1901 3.2415 5.2730 33.0771 12.5358 12.4465 1.6188 2.1749 0.4485 2.1840 4.5588 30.3231 35.9812 13.0542 12.7127 15.5183 16.7874 1.9186 1.5994 0.1106 10.4698 1.8416 0.2396 13.1001 4.5787 11.6291 16.6634 17.2816 171.5413 202.6668 11.2991 5.1039 37.6180 42.2368 18.7140 5.4561 24.6040 15.8115 95.8363 37.2755 34.0566 43.2918 48.5299 9.0330 4.2544 7.2162 16.1081 1.0768 20.4236 50.1201 6.3282 47.5009 35.6287 2.0049 8.1880 73.0898 67.8693 49.4906 94.2400 13.7487 35.7814 17.6868 18.8726 5.4357 4.8488
temp: 298.150 k
press: 1.00000 atm
elementType: 8 8 8 8 8 6 6 6 6 6 6 6 6 6 6 6 6 6 6 6 6 6 6 6 6 1 1 1 1 1 1 1 1 1 1 1 1 1 1 1 1 1 1 1 1 1 1 1 1 1 1 1 1 1 1 1 1 1 1
symmnumber: 1
zpe: 1329934.3 jmol-1
zpe.correction: 0.506545 hartree
zpe.thermalcorrener: 0.536445 hartree
zpe.thermalcorrenthalpy: 0.537390 hartree
zpe.thermalcorrgfe: 0.440089 hartree
zpe.sumelectzpe: -1156.628236 hartree
zpe.sumelectthermal: -1156.598335 hartree
zpe.sumelectthermalent: -1156.597391 hartree
zpe.sumelectthermalfe: -1156.694692 hartree
dipole: 1.3344 -0.1820 0.5446
dipole: 1.4527
quadrupole: -134.3202 -181.8982 -153.6293
quadrupole: -10.3115 13.9504 5.9893
quadrupole: 22.2957 -25.2823 2.9866 -10.3115 13.9504 5.9893
hfenergy: -1157.1347808 hartree
pointgroup: C01 [X(C20H34O5)]
dipole: 0.5156589 0.1065111 -0.2222629 debye
polarizability: 258.31172|10.9719889|257.4302653|-6.7286048|-2.8912309|182.554249 unknown
InChI: InChI=1S/C20H34O5/c1-2-3-6-9-15(21)12-13-17-16(18(22)14-19(17)23)10-7-4-5-8-11-20(24)25/h12-13,15-17,19,21,23-24H,2-11,14H2,1H3
charge 0 multiplicity 1
59 atoms
O  5.586902 0.336253 -0.226393
O  2.424956 4.020455 0.199657
O  3.164817 -4.369539 -0.342649
O  -5.864431 -0.379983 -0.55201
O  -4.921648 1.058258 -2.110133
C  2.073433 1.570459 -0.105789
C  3.156794 0.44861 0.010443
C  4.401695 1.070861 -0.680284
C  4.374559 2.556735 -0.255819
C  0.907368 1.469968 0.905203
C  2.887877 2.87812 -0.03062
C  -0.3399 2.292568 0.509495
C  2.719125 -0.868072 -0.576149
C  -1.461213 2.205457 1.570364
C  2.573436 -2.029424 0.11247
C  -2.720482 3.041062 1.226433
C  2.115625 -3.329811 -0.508037
C  0.855276 -3.919207 0.151923
C  -3.539267 2.54187 0.009464
C  -0.396827 -3.032759 -0.019044
C  -4.221372 1.182674 0.268217
C  -1.668881 -3.655424 0.598561
C  -2.900136 -2.726582 0.499835
C  -4.998809 0.666755 -0.925186
C  -4.189913 -3.346921 1.07788
H  1.645249 1.53207 -1.134968
H  3.419263 0.312269 1.079676
H  4.295239 0.988727 -1.784945
H  4.897411 2.665896 0.716434
H  4.834782 3.266371 -0.965294
H  0.627772 0.40035 1.000191
H  1.263761 1.796942 1.903243
H  -0.713014 1.928112 -0.469784
H  -0.046808 3.349974 0.368241
H  2.480323 -0.855204 -1.654038
H  -1.056566 2.563685 2.538948
H  -1.736827 1.141789 1.732907
H  6.386772 0.682691 -0.696427
H  2.815435 -2.073295 1.185375
H  -3.385582 3.077116 2.114065
H  -2.403722 4.085723 1.033232
H  1.920534 -3.166406 -1.592187
H  0.679286 -4.917442 -0.294508
H  1.065857 -4.082559 1.227242
H  -4.317231 3.290033 -0.23569
H  -2.899516 2.466563 -0.888768
H  -0.574543 -2.84112 -1.098463
H  -0.213737 -2.041457 0.445062
H  -1.479919 -3.901092 1.664439
H  -1.892774 -4.617898 0.093285
H  -4.906483 1.235267 1.135189
H  -3.473339 0.405493 0.523537
H  4.033562 -3.97702 -0.616467
H  -3.066339 -2.452856 -0.562757
H  -2.676324 -1.778941 1.034415
H  -4.451901 -4.280901 0.545241
H  -4.065217 -3.597864 2.14834
H  -5.041415 -2.64862 0.984811
H  -6.339577 -0.711477 -1.362408
