program: Gaussian 09
title: 000164917
version: EM64L-G09RevD.01
frameworkgroup: C1[X(C20H24N2O)]
method: RPBEPBE
basis: SDD
operation: Freq
keyword: #p
keyword: freq=noraman
keyword: PBEPBE/SDD
title: #p freq=noraman PBEPBE/SDD
converged: YES YES NO NO
title: Mulliken charges:
elementType: O N N C C C C C C C C C C C C C C C C C C C C H H H H H H H H H H H H H H H H H H H H H H H H
charge: -0.247521 -0.126054 -0.567542 -0.044078 -0.136780 -0.479228 0.123402 -0.413938 0.361742 0.405694 -0.348526 -0.415910 -0.324650 -0.391576 -0.427148 -0.363829 -0.671170 -0.259507 -0.246880 -0.258178 -0.252801 -0.244257 -0.249691 0.234069 0.235707 0.233273 0.247609 0.206770 0.256728 0.211272 0.176872 0.219669 0.272725 0.260415 0.230843 0.235729 0.218788 0.230167 0.223975 0.262309 0.274474 0.225078 0.224790 0.220612 0.223593 0.225600 0.227361
chargesum: 0.00000
title: Mulliken charges with hydrogens summed into heavy atoms:
elementType: O N N C C C C C C C C C C C C C C C C C C C C
charge: -0.247521 -0.126054 -0.030759 -0.044078 0.097289 -0.010248 0.123402 0.040441 0.361742 0.405694 0.119474 -0.019369 -0.051925 -0.131161 -0.196305 -0.128101 0.001760 -0.034430 -0.022090 -0.037567 -0.029208 -0.018657 -0.022330
polarizability: 2.55894091e+02 -4.34083681e+00 1.99080040e+02 7.62986197e+00 -3.43929424e+00 2.12779473e+02
1716.lowfreq: -8.4080 -0.0004 0.0007 0.0009 2.0798 9.1292 35.8627 40.4263 44.8640
frequency: 35.8158 40.4204 44.8517 53.9925 58.6739 67.3511 74.2585 83.2320 98.5665 127.8665 146.6796 179.8240 202.1404 211.2905 230.5897 246.6222 250.5967 262.0455 277.8586 300.8463 316.4544 336.4097 356.6155 404.1082 405.1881 411.8010 457.7533 489.1023 525.7234 551.3652 568.9483 588.3746 616.6486 616.7473 642.0417 671.0673 698.2720 698.6836 702.5232 710.1344 755.1476 775.0088 787.7111 794.0690 837.3369 846.2165 858.1437 885.1006 905.9076 917.9477 927.4628 948.8296 963.6666 970.9189 981.9376 982.4641 990.3530 991.1697 992.6057 995.9719 1016.0720 1028.5723 1033.4333 1050.0993 1076.4177 1080.6696 1089.8170 1096.6485 1108.6492 1113.6643 1126.4363 1158.2429 1165.2163 1172.6112 1173.4079 1192.2274 1198.6551 1199.6227 1216.7182 1233.3923 1235.0711 1264.5111 1289.8534 1297.0014 1305.9755 1323.2420 1326.9503 1334.0281 1350.2185 1361.0245 1372.3043 1378.1254 1387.7347 1389.1253 1403.5956 1432.5734 1434.3455 1461.6413 1466.5400 1473.1199 1480.2501 1481.7239 1485.6461 1490.3332 1495.3196 1586.1471 1588.5896 1608.4882 1611.2951 1632.2312 1639.0202 2842.8705 2954.4557 2979.7536 2980.5226 2983.0347 2984.6439 3004.6009 3027.6300 3057.7984 3058.2282 3083.0821 3091.6939 3119.9873 3120.3279 3126.9231 3131.7031 3139.8015 3145.8572 3147.1166 3158.0277 3162.3860 3173.3901 3458.5885 3587.0820
redmass: 3.8831 2.6588 4.0645 3.8496 4.0320 4.1314 4.3324 2.1265 3.6288 3.8885 3.5970 3.9049 1.5399 2.0575 1.2222 3.5237 4.0058 4.3066 3.1906 3.6979 3.0566 3.2073 6.0946 2.8589 2.9290 3.0445 2.8340 3.6611 3.1157 3.2131 2.0213 2.1121 6.3199 6.2090 5.4658 4.0383 5.2851 5.6909 1.7317 1.6048 2.0887 1.9651 1.2456 1.2372 3.1040 1.2762 1.2449 2.9724 1.9919 1.7292 1.6091 2.1972 2.2619 1.4041 1.9376 1.5216 4.7734 3.3177 1.6440 1.3565 2.8954 2.4587 2.2114 2.1885 2.1611 2.2123 1.6448 1.7238 2.4914 2.7202 2.1252 1.6906 2.3839 1.0535 1.0607 1.5105 1.1416 1.1619 2.1326 1.6946 2.2778 1.8812 1.1093 1.3144 1.5007 1.3652 1.3688 1.4279 1.4720 1.3183 5.9271 6.8590 1.2176 1.4500 2.2232 2.2616 2.2520 1.0803 1.0887 1.0429 1.1812 1.7509 2.1377 1.0917 1.1103 5.8890 6.0346 5.9703 5.9983 9.4436 1.0950 1.0719 1.0641 1.0685 1.0786 1.0607 1.0393 1.0842 1.0991 1.0979 1.0986 1.0989 1.1016 1.0844 1.0842 1.0873 1.0885 1.0917 1.0929 1.0958 1.0978 1.1014 1.0968 1.0448 1.0979
irintensity: 0.5147 0.1793 0.1111 0.5035 0.8363 0.4580 0.6591 2.8824 2.4503 3.0014 0.6039 0.1623 2.2514 1.1810 44.3908 0.5592 0.8906 0.3903 7.4254 4.0095 7.9179 7.0595 10.1708 0.7479 1.7828 2.9213 8.7408 6.3639 19.1925 1.9188 75.0666 140.2818 1.4239 1.5443 15.6957 6.1966 2.6792 5.8774 48.4701 58.7995 35.4639 20.7424 9.3023 11.3153 4.3730 0.3544 0.3707 1.2991 4.5579 2.9861 0.2756 9.0450 4.4877 0.5092 1.7049 2.6108 0.2372 0.4459 0.3309 0.0729 3.5082 9.0665 7.9514 1.9297 11.6137 8.1076 4.6294 5.7666 14.9996 20.1783 3.0460 8.8334 8.2976 0.0909 0.1874 3.9834 3.8379 5.3805 14.8282 6.9333 16.2552 119.7084 3.9162 11.1232 35.2899 0.9987 2.6670 4.1160 6.0734 2.0132 1.1549 0.8319 16.9743 16.3410 48.1309 12.0389 3.6049 19.4417 6.8491 12.6670 4.9627 32.8853 24.2305 5.6928 11.4702 1.2249 0.4123 13.6938 4.6668 235.6411 42.6294 107.4118 37.0253 10.8423 25.4579 48.1298 30.1438 36.8188 46.2760 1.1481 35.0020 48.2462 38.6982 1.4031 1.7557 1.5098 9.4439 15.1410 45.0597 34.5588 29.8501 24.8183 5.2092 0.8704 0.3793
temp: 298.150 k
press: 1.00000 atm
elementType: 8 7 7 6 6 6 6 6 6 6 6 6 6 6 6 6 6 6 6 6 6 6 6 1 1 1 1 1 1 1 1 1 1 1 1 1 1 1 1 1 1 1 1 1 1 1 1
symmnumber: 1
zpe: 1036597.4 jmol-1
zpe.correction: 0.394819 hartree
zpe.thermalcorrener: 0.416875 hartree
zpe.thermalcorrenthalpy: 0.417819 hartree
zpe.thermalcorrgfe: 0.342889 hartree
zpe.sumelectzpe: -959.574105 hartree
zpe.sumelectthermal: -959.552049 hartree
zpe.sumelectthermalent: -959.551105 hartree
zpe.sumelectthermalfe: -959.626036 hartree
dipole: 1.7828 3.3947 -2.0170
dipole: 4.3325
quadrupole: -122.4681 -140.8943 -127.7442
quadrupole: -7.9110 -3.9306 -6.6580
quadrupole: 7.9008 -10.5254 2.6246 -7.9110 -3.9306 -6.6580
hfenergy: -959.9689244 hartree
pointgroup: C01 [X(C20H24N2O1)]
dipole: 0.8180412 0.7902853 1.2695325 debye
polarizability: 254.5951674|-4.4565631|211.8279337|-11.6036635|4.1694703|201.3305023 unknown
InChI: InChI=1S/C20H24N2O/c1-2-22-15-18(13-14-21)20(19(22)23,16-9-5-3-6-10-16)17-11-7-4-8-12-17/h3-12,18H,2,13-15,21H2,1H3
charge 0 multiplicity 1
47 atoms
O  0.005889 0.444757 -2.766959
N  1.632266 1.407482 -1.374668
N  1.530109 1.267767 4.518003
C  -0.1283 0.244866 -0.233668
C  0.637478 1.199615 0.766916
C  1.983608 1.497638 0.051548
C  0.46588 0.69672 -1.617938
C  0.813214 0.702239 2.214344
C  -1.657893 0.425408 -0.227106
C  0.25314 -1.241007 0.012527
C  2.482493 1.932541 -2.451784
C  1.412057 1.782563 3.141544
C  -2.431511 -0.248705 -1.211318
C  -0.533237 -2.04363 0.879808
C  -2.338882 1.214976 0.733659
C  1.419815 -1.816262 -0.555925
C  3.781696 1.122752 -2.657886
C  -3.83571 -0.123687 -1.23964
C  -0.164597 -3.374105 1.173767
C  -3.748365 1.336962 0.710784
C  1.789296 -3.148692 -0.266424
C  -4.504156 0.669331 -0.277119
C  1.001284 -3.93463 0.603649
H  0.076814 2.156371 0.779325
H  2.371592 2.505396 0.291016
H  2.760672 0.754842 0.329068
H  1.461867 -0.191688 2.246508
H  -0.168947 0.386693 2.621785
H  1.870562 1.906932 -3.370872
H  2.72527 2.99048 -2.228429
H  0.792019 2.7120 3.053255
H  2.429522 2.046779 2.792951
H  -1.919583 -0.853511 -1.965129
H  -1.448939 -1.629461 1.315186
H  -1.783875 1.744254 1.51487
H  2.037938 -1.231455 -1.246614
H  4.404473 1.107665 -1.744723
H  3.55048 0.081002 -2.941958
H  4.382154 1.572881 -3.469123
H  0.643333 0.949576 4.921545
H  2.05314 1.869746 5.160325
H  -4.409059 -0.644649 -2.01482
H  -0.790011 -3.973653 1.845115
H  -4.25138 1.95246 1.465669
H  2.689148 -3.573515 -0.725985
H  -5.59586 0.76388 -0.297433
H  1.285694 -4.968926 0.827354
