program: Gaussian 09
title: 000164889
version: EM64L-G09RevD.01
frameworkgroup: C1[X(C8H9NO2)]
method: RPBEPBE
basis: SDD
operation: Freq
keyword: #pfreq=noraman
keyword: PBEPBE/SDD
title: #p freq=noraman PBEPBE/SDD
converged: YES YES NO NO
title: Mulliken charges:
elementType: O O N C C C C C C C C H H H H H H H H H
charge: -0.363355 -0.171754 -0.002024 0.389666 0.154208 0.101984 0.010852 -0.541832 -0.833239 -0.818360 -0.209706 0.254352 0.234490 0.241348 0.240701 0.234129 0.283950 0.233783 0.184713 0.376095
chargesum: 0.00000
title: Mulliken charges with hydrogens summed into heavy atoms:
elementType: O O N C C C C C C C C
charge: 0.012739 -0.171754 -0.002024 0.389666 0.154208 0.101984 0.010852 -0.287480 -0.116701 -0.066498 -0.024994
polarizability: 1.32076354e+02 3.57664582e+00 1.21017760e+02 3.36955943e-02 6.08948868e-03 5.03743272e+01
1716.lowfreq: 0.0007 0.0008 0.0011 5.3033 6.0003 8.7534 64.9888 110.0645 124.5974
frequency: 64.9831 110.0623 124.5871 169.8043 191.7696 208.2970 266.6238 301.8116 314.6374 322.7616 389.4321 396.3136 468.1178 504.9988 532.8411 580.0250 589.0967 660.6503 730.8117 764.5529 896.4276 909.6797 956.3403 966.2060 1016.2384 1041.4987 1043.4286 1054.9146 1184.1775 1226.4676 1244.8520 1296.3175 1319.9345 1381.9242 1397.6456 1402.7015 1418.2726 1451.4701 1465.8749 1475.4532 1478.6073 1478.8325 1539.9869 1570.0942 1618.3198 2897.4078 2959.5364 2984.5146 3031.3129 3065.6163 3087.3914 3116.2971 3133.3041 3540.6322
redmass: 5.8774 2.5624 2.4324 1.0721 1.1156 6.8382 3.3684 2.7467 3.8752 2.6906 8.4860 1.3177 4.7068 3.6670 4.6508 6.0795 3.6807 5.5200 5.9544 4.2506 1.3429 2.5062 2.6156 1.8668 1.4893 1.5419 1.5730 3.2495 1.8937 3.8903 4.4845 1.8996 4.1714 2.2493 1.4081 1.5303 1.3594 1.5301 1.5517 1.0487 1.1545 1.0463 5.0260 6.8434 6.5700 1.0826 1.0404 1.0372 1.0980 1.0980 1.0986 1.0942 1.0917 1.0649
irintensity: 10.0179 7.6046 0.4198 0.0301 0.0578 5.1923 11.4655 1.3970 3.5996 10.5942 10.8532 105.9267 5.8993 8.1157 0.6777 8.3106 10.6017 22.6560 2.2302 0.0012 10.3640 28.7023 23.5388 3.5708 16.6999 9.0801 2.1782 25.6697 142.6840 37.4143 1.5200 3.0180 95.0411 108.5319 23.5558 0.1805 14.0113 20.2184 20.4302 15.2107 18.8663 17.7965 0.6930 97.8140 118.5199 101.5725 21.5346 27.5480 19.5857 13.9615 18.4513 2.7830 22.0338 46.8993
temp: 298.150 k
press: 1.00000 atm
elementType: 8 8 7 6 6 6 6 6 6 6 6 1 1 1 1 1 1 1 1 1
symmnumber: 1
zpe: 402805.7 jmol-1
zpe.correction: 0.153421 hartree
zpe.thermalcorrener: 0.164285 hartree
zpe.thermalcorrenthalpy: 0.165229 hartree
zpe.thermalcorrgfe: 0.117237 hartree
zpe.sumelectzpe: -514.621187 hartree
zpe.sumelectthermal: -514.610323 hartree
zpe.sumelectthermalent: -514.609379 hartree
zpe.sumelectthermalfe: -514.657371 hartree
dipole: 1.0586 -2.1677 -0.0027
dipole: 2.4123
quadrupole: -54.3482 -74.6457 -65.2043
quadrupole: 15.8491 0.0368 -0.0032
quadrupole: 10.3845 -9.9130 -0.4716 15.8491 0.0368 -0.0032
hfenergy: -514.7746075 hartree
pointgroup: C01 [X(C8H9N1O2)]
dipole: 0.59787 0.7355142 0.0484196 debye
dipolederiv: -0.0884052 0.082974 0.0113138 0.3405203 -1.241583 -0.0122126 0.0187571 -0.0206502 -0.3745045 -0.5815553 -0.1965499 -0.0175304 -0.4720221 -0.7822522 -0.0362747 -0.0276426 -0.0260067 -0.3087801 -0.2209835 -0.1181036 -0.0033529 -0.2006736 -0.0999541 -0.0042297 -0.0056574 -0.0007658 -0.2260424 0.3670953 -0.3503426 0.0028087 0.2240211 0.0843111 0.0105233 0.0225292 -0.0125333 0.0226476 -0.6968553 -0.0953269 -0.0301612 -0.2586769 -0.2486319 -0.0173261 -0.033363 -0.0105713 -0.0383639 -0.1673225 0.2307798 -0.00443 -0.4518518 1.0618107 0.0081451 -0.0258518 0.034337 0.1522747 0.5890422 -0.49684 0.0090654 0.0509594 -0.2008583 -0.0025231 0.0244817 -0.0233299 -0.0337732 -0.3955295 0.3114927 -0.00152 -0.0151893 0.2605347 0.011326 -0.0114016 0.0235313 -0.1206329 -0.1185915 0.1538036 -0.0018337 0.0546253 0.0482624 0.0024012 -0.0068414 0.0075463 0.0434854 -0.1928724 0.0884451 -0.0082545 0.0911116 -0.0707286 -0.0015524 -0.0073773 -0.0016208 0.0787176 1.2467388 0.2846139 0.054847 0.423979 0.8994252 0.0472502 0.0589115 0.0411076 0.1042232 0.076254 0.0284122 -0.0016221 0.0237531 -0.1240329 -0.0074787 -0.0017238 -0.0075548 0.1431514 0.0830389 -0.13183 -0.0062395 0.0013202 -0.1301316 -0.0094143 -0.0010369 -0.0144001 0.111295 -0.0012168 0.0379222 -0.0881709 0.00134 0.0777099 -0.0520622 -0.1090522 -0.0106532 -0.0380819 -0.0184584 0.0286701 0.0923587 -0.0128237 0.0720149 0.0599852 0.1106581 0.0209364 -0.0147012 0.04903 0.0230519 -0.0185006 0.0834344 0.0129448 -0.1061914 0.0350436 -0.1070563 -0.047624 0.0293242 -0.035546 -0.0055129 -0.1467682 0.0512029 -0.0088153 -0.0091863 -0.0041029 0.1301 0.0498037 0.0121251 0.0275206 0.075964 -0.0024518 0.1160231 -0.0223952 0.1116735 -0.032768 -0.1499378 0.1099457 -0.0055225 0.1984645 -0.0797534 0.0006164 -0.0025832 -0.0024464 0.1004828 0.1414011 0.0323027 -0.0052629 -0.0114873 0.4121612 0.00181 -0.0062684 0.0025598 0.3488942 unknown
polarizability: 129.8135432|-5.7388031|123.0959841|2.9563634|2.1086213|50.5589142 unknown
InChI: InChI=1S/C8H9NO2/c1-5-3-9-6(2)8(11)7(5)4-10/h3-4,11H,1-2H3
charge 0 multiplicity 1
20 atoms
O  0.43828 -2.214983 -0.088444
O  -2.31901 -2.040482 -0.205533
N  1.715056 1.24933 0.064867
C  -0.738649 1.315719 -0.027303
C  -0.789229 -0.118465 -0.074448
C  0.451257 -0.825615 -0.04745
C  1.688067 -0.108895 0.022189
C  0.531922 1.930132 0.040657
C  -1.978218 2.19449 -0.048435
C  3.012593 -0.844879 0.050803
C  -2.109785 -0.800068 -0.150261
H  0.613455 3.022261 0.077876
H  -1.684748 3.256634 0.005425
H  -2.569153 2.059493 -0.972779
H  -2.649134 1.991666 0.806214
H  3.179162 -1.450461 -0.863128
H  3.820236 -0.099969 0.109371
H  3.105739 -1.513069 0.930836
H  -2.977249 -0.096507 -0.157322
H  1.36461 -2.569533 -0.069034
