program: Gaussian 09
title: 000164882
version: EM64L-G09RevD.01
frameworkgroup: C1[X(C12H22N2O)]
method: RPBEPBE
basis: SDD
operation: Freq
keyword: #p
keyword: freq=noraman
keyword: PBEPBE/SDD
title: #p freq=noraman PBEPBE/SDD
converged: YES YES NO NO
title: Mulliken charges:
elementType: O N N C C C C C C C C C C C C H H H H H H H H H H H H H H H H H H H H H H
charge: -0.321318 0.019188 -0.080202 -0.036700 -0.157358 -0.433518 -0.429949 -0.387451 -0.386843 -0.424997 -0.424582 -0.394767 -0.381617 -0.397711 -0.382532 0.251435 0.255573 0.231481 0.210873 0.214081 0.229718 0.236785 0.196086 0.190174 0.206288 0.206375 0.195488 0.195878 0.206349 0.203630 0.197040 0.202959 0.194184 0.193655 0.217449 0.187035 0.197820
chargesum: 0.00000
title: Mulliken charges with hydrogens summed into heavy atoms:
elementType: O N N C C C C C C C C C C C C
charge: -0.321318 0.019188 -0.080202 0.214735 0.098215 0.008836 0.013851 0.014412 0.015384 0.007873 -0.028119 0.005903 0.015526 0.013394 0.002323
polarizability: 1.83213131e+02 1.90150777e+00 1.26497188e+02 3.94759642e+00 1.39424624e+00 1.26291921e+02
1716.lowfreq: -0.0005 -0.0003 0.0008 3.9615 8.9360 22.2849 32.4048 57.5127 69.1917
frequency: 28.1555 57.2023 68.6109 83.6152 117.1038 175.1443 210.0074 217.5913 219.8933 261.8197 296.3234 309.6308 349.9348 381.3395 395.0702 429.5561 465.8372 472.7489 490.3725 501.5334 631.1797 674.1062 710.6845 776.8954 781.8102 789.0034 808.4262 826.6421 846.5175 862.7501 868.0468 889.0837 897.5462 904.9104 925.8821 930.6441 944.9798 998.9757 1011.7803 1047.5774 1051.1507 1051.6541 1056.7540 1077.2902 1088.1842 1112.4813 1115.4293 1129.9882 1144.2063 1154.2736 1190.4496 1196.7859 1235.3237 1242.6317 1255.5140 1256.1013 1262.6676 1267.8332 1279.5589 1289.2269 1309.7497 1314.9076 1328.1914 1331.3320 1336.2805 1339.0678 1339.7429 1342.0887 1349.4970 1351.1767 1354.7243 1358.1515 1408.8354 1455.7843 1462.8407 1463.4072 1464.1385 1464.2864 1465.9777 1471.8812 1472.2712 1478.5556 1481.0613 2960.3038 2963.3700 2969.8952 2970.2596 2973.7471 2975.6162 2977.7257 2982.2898 2986.9528 2990.9441 2993.5613 3025.9478 3033.3150 3034.1761 3034.2090 3036.2521 3039.4608 3044.3069 3048.1083 3055.0633 3056.1810 3069.4086
redmass: 3.2227 3.7512 3.9426 3.8728 3.2104 3.5550 2.6358 2.7448 1.9372 3.0474 2.4476 3.2377 1.9198 2.2498 2.6339 3.1491 2.2213 3.2935 2.4139 1.6253 3.2015 6.0490 3.9273 1.9031 1.9795 1.4469 3.1885 1.8445 2.3512 2.0243 2.0394 2.0453 1.5300 2.4801 1.8219 1.4865 2.9144 2.4730 2.7273 1.6183 1.6131 1.5987 1.2417 1.3242 1.5984 1.0418 2.4546 2.1381 2.4709 1.8655 1.5227 2.7341 1.4131 1.5373 1.2821 1.3192 1.3197 1.2616 1.4066 1.4341 1.3137 1.5244 1.3227 1.4321 1.4024 1.4919 1.5157 1.4806 1.4546 1.4460 1.4816 1.5605 3.7806 1.0874 1.0859 1.0861 1.0885 1.0880 1.0876 1.0814 1.0840 1.0950 1.0924 1.0629 1.0755 1.0632 1.0643 1.0617 1.0631 1.0614 1.0622 1.0713 1.0600 1.0611 1.0959 1.0981 1.0990 1.0958 1.0902 1.1000 1.1011 1.1021 1.1004 1.1037 1.0997
irintensity: 0.1066 0.7811 0.7708 0.3005 0.5360 0.3788 2.3599 2.2710 0.9278 3.3179 4.0772 8.6839 0.7385 1.0697 2.8847 0.0212 5.0270 7.2098 2.2314 0.3023 0.0370 1.1968 9.7132 0.6400 2.0435 0.2733 0.8452 2.0682 5.0615 2.9304 8.0844 5.9088 15.7029 17.7875 0.0843 8.1168 4.6586 5.2590 10.7509 0.4627 0.2971 0.2598 0.4441 0.1929 0.2297 1.4037 0.0330 3.0390 10.6911 2.1888 0.1637 31.9321 0.2058 3.1105 1.3074 0.2634 2.5108 2.5860 3.8340 1.7885 1.2971 19.5314 1.0792 0.5586 0.8424 6.6975 8.8635 1.0320 3.7709 10.1828 7.1845 8.4564 83.3883 7.6698 7.5712 0.8381 9.6748 11.6943 12.2962 19.9774 22.1636 5.6003 4.5063 43.4172 4.1379 25.0686 41.2888 34.3364 9.1581 34.8880 46.3498 51.0882 32.6674 11.8452 71.1850 58.3354 66.8185 72.2776 2.5389 13.8439 40.0403 53.2488 65.8039 9.2544 57.7354
temp: 298.150 k
press: 1.00000 atm
elementType: 8 7 7 6 6 6 6 6 6 6 6 6 6 6 6 1 1 1 1 1 1 1 1 1 1 1 1 1 1 1 1 1 1 1 1 1 1
symmnumber: 1
zpe: 864191.2 jmol-1
zpe.correction: 0.329153 hartree
zpe.thermalcorrener: 0.343644 hartree
zpe.thermalcorrenthalpy: 0.344588 hartree
zpe.thermalcorrgfe: 0.287190 hartree
zpe.sumelectzpe: -653.944049 hartree
zpe.sumelectthermal: -653.929559 hartree
zpe.sumelectthermalent: -653.928615 hartree
zpe.sumelectthermalfe: -653.986013 hartree
dipole: 0.9349 0.1517 -1.5325
dipole: 1.8015
quadrupole: -83.2261 -90.7502 -97.9347
quadrupole: 0.5790 -3.3683 -0.2530
quadrupole: 7.4109 -0.1132 -7.2977 0.5790 -3.3683 -0.2530
hfenergy: -654.2732025 hartree
pointgroup: C01 [X(C12H22N2O1)]
dipole: 0.364294 -0.0502157 0.6059103 debye
polarizability: 183.2449343|-2.1191615|126.5553301|-3.5913413|1.3878568|126.2019763 unknown
InChI: InChI=1S/C12H22N2O/c15-14(12-9-5-2-6-10-12)13-11-7-3-1-4-8-11/h11-12H,1-10H2
charge 0 multiplicity 1
37 atoms
O  0.408153 0.13793 -1.886012
N  0.314053 0.232974 -0.571978
N  -0.772696 0.468142 0.129686
C  1.597988 0.080288 0.224938
C  -2.002371 0.655838 -0.704917
C  2.227153 -1.299668 -0.067145
C  2.559234 1.235007 -0.137909
C  3.569326 -1.450451 0.688808
C  3.899406 1.077524 0.619416
C  -2.586971 -0.720242 -1.146098
C  -3.018225 1.449194 0.147712
C  4.545335 -0.300807 0.342987
C  -3.138312 -1.535714 0.0472
C  -3.551528 0.622604 1.341218
C  -4.16514 -0.716307 0.866061
H  1.286646 0.153117 1.281812
H  -1.726919 1.21866 -1.621653
H  2.390755 -1.384229 -1.157897
H  1.524059 -2.102096 0.227222
H  2.08649 2.205246 0.106031
H  2.73309 1.212854 -1.230405
H  -1.814719 -1.285285 -1.69936
H  -3.409487 -0.511735 -1.860541
H  -3.863409 1.736917 -0.510804
H  -2.548381 2.385207 0.504112
H  4.022364 -2.428882 0.440001
H  3.38203 -1.454639 1.782645
H  3.725831 1.189638 1.70973
H  4.586877 1.891881 0.321437
H  5.481651 -0.407064 0.923606
H  4.820359 -0.365776 -0.729646
H  -2.300354 -1.830895 0.709798
H  -3.600907 -2.470171 -0.325879
H  -4.300651 1.212655 1.903805
H  -2.711482 0.413715 2.032266
H  -5.056082 -0.510512 0.235573
H  -4.516863 -1.305616 1.735179
