program: Gaussian 09
title: 000164936
version: EM64L-G09RevD.01
frameworkgroup: C1[X(C21H26N2O3)]
method: RPBEPBE
basis: SDD
operation: Freq
keyword: #p
keyword: freq=noraman
keyword: PBEPBE/SDD
title: #p freq=noraman PBEPBE/SDD
converged: YES YES NO NO
title: Mulliken charges:
elementType: O O O N N C C C C C C C C C C C C C C C C C C C C C H H H H H H H H H H H H H H H H H H H H H H H H H H
charge: -0.271755 -0.218969 -0.269532 -0.127473 -0.473396 -0.115015 -0.249871 -0.023639 -0.011574 -0.475268 -0.577722 -0.607713 -0.447364 0.244187 0.125534 0.143083 0.130366 -0.641895 -0.714831 0.099027 0.209295 -0.425222 -0.352800 -0.502806 -0.257011 -0.220672 0.221080 0.262110 0.264058 0.217658 0.187874 0.230281 0.246971 0.230006 0.231048 0.238768 0.211893 0.193391 0.195078 0.258774 0.227650 0.219045 0.225381 0.216244 0.325716 0.230380 0.236527 0.234066 0.244453 0.240955 0.221126 0.222503
chargesum: 0.00000
title: Mulliken charges with hydrogens summed into heavy atoms:
elementType: O O O N N C C C C C C C C C C C C C C C C C C C C C
charge: -0.271755 -0.218969 -0.269532 -0.127473 -0.147680 0.106065 0.012239 0.240418 0.206084 -0.057112 -0.100745 -0.137897 -0.042081 0.244187 0.125534 0.143083 0.130366 0.039608 -0.054162 0.099027 0.209295 -0.194842 -0.116273 0.216667 -0.035885 0.001830
polarizability: 3.38351084e+02 1.46572821e+01 2.44677667e+02 1.63257334e+01 2.48285535e+01 1.92379788e+02
1716.lowfreq: 0.0003 0.0006 0.0007 5.2392 9.2655 9.8893 26.7629 36.5959 47.7351
frequency: 26.6226 36.5918 47.7188 64.5084 71.3718 82.8900 102.6376 103.2387 116.4262 138.6966 147.2609 150.3461 160.2449 179.4986 202.6788 210.7279 224.2456 236.8670 243.8413 259.5996 280.3167 286.7293 309.0429 325.9833 337.3805 362.1469 373.6405 389.3228 416.6455 435.4777 474.5898 487.0683 498.4357 514.8821 532.8176 554.2750 575.6144 601.6643 608.7532 626.6585 630.3429 681.7817 688.3367 723.8024 727.4337 750.0672 757.3361 764.0101 785.2662 786.0917 822.9604 849.3566 857.8175 859.6298 872.8965 895.3971 904.3146 930.8190 933.4834 943.8474 959.3862 970.8658 974.8387 1003.2190 1009.3183 1031.2812 1044.1002 1051.3303 1070.2655 1072.3599 1101.4789 1112.2720 1114.1064 1119.1577 1121.2135 1139.9540 1149.2291 1153.9103 1156.4871 1165.6499 1176.7147 1197.3922 1213.3056 1229.9528 1230.4506 1241.8623 1242.9890 1250.6529 1271.7124 1279.9519 1299.7483 1306.5034 1310.7878 1317.0473 1328.3681 1330.1719 1337.6771 1343.0288 1352.8607 1361.8115 1370.3913 1375.0854 1389.9183 1408.5886 1422.7224 1434.3680 1444.9481 1453.5682 1455.0896 1458.9174 1462.6802 1464.2570 1468.1732 1474.3545 1477.4245 1480.4146 1484.0511 1485.2009 1488.7892 1522.9294 1570.1625 1577.7136 1626.8886 1634.4151 2820.9028 2866.9881 2874.3148 2950.3307 2971.1861 2975.8859 2976.1675 2994.0187 2999.4858 3004.6904 3011.6474 3017.4699 3029.4622 3035.8815 3042.3814 3067.4476 3071.5620 3072.9965 3085.9574 3106.4608 3122.4314 3131.5801 3145.5977 3149.9856 3162.6893 3579.4848
redmass: 5.0677 6.0238 4.2951 4.1796 3.6957 4.1131 2.1457 1.5836 2.3472 2.7081 3.6025 4.0039 3.1764 3.9501 2.0373 1.9781 1.9383 1.2303 3.3654 4.6400 3.5217 3.2182 3.4606 3.2553 4.0977 4.1988 4.8011 4.3240 3.6215 3.0226 3.8540 3.9796 3.3829 3.8284 3.8352 3.7761 3.8254 5.3568 5.5439 4.5342 1.1310 5.3713 4.1751 5.2166 3.7342 1.3613 3.0532 2.0038 3.9279 2.4212 3.3730 1.5201 3.8263 5.2009 3.0128 3.4441 3.7226 1.7360 1.3892 2.2021 2.5876 1.3054 2.7223 2.9196 2.1001 2.2939 2.5260 2.0886 2.7659 2.6658 1.6100 1.8318 1.2696 1.7632 2.3117 2.4098 1.4983 1.7191 2.4521 1.3487 2.2011 1.2790 1.3599 1.4382 2.1108 1.3711 1.9256 1.3166 1.5350 1.3257 1.4182 1.3632 1.3784 1.3416 1.7124 1.6196 1.5618 1.5856 1.6929 1.7013 1.5478 1.4633 1.2132 3.0296 1.1824 1.1682 4.9423 1.0500 1.9005 1.6412 1.0764 1.0528 1.0535 1.1303 1.0513 1.0559 3.1819 1.0624 1.0710 7.4052 8.0152 6.0950 7.4037 9.7658 1.0717 1.0787 1.0596 1.0630 1.0807 1.0361 1.0646 1.0780 1.0847 1.0296 1.0678 1.0949 1.0741 1.0949 1.0885 1.1014 1.1002 1.0992 1.1006 1.1045 1.0852 1.0885 1.0951 1.1049 1.1001 1.0801
irintensity: 0.4833 1.2208 0.3545 0.2433 0.1888 0.8720 0.6401 1.1728 0.2330 0.5004 0.5259 3.6020 7.0263 0.3426 7.2434 0.7171 4.3872 0.7131 0.9841 3.7735 3.9328 9.3058 9.0818 3.8876 0.3763 1.6904 2.9636 8.6595 3.2156 8.7174 7.1547 1.5996 2.6821 13.4272 2.3816 0.6448 1.6217 4.4835 2.9667 7.1154 78.6166 1.3230 6.1142 6.1123 3.1840 108.8313 4.8311 7.4752 6.6519 0.0108 1.4222 1.8862 14.4516 13.8529 1.1858 2.0715 7.5249 5.2167 2.6363 7.8484 16.4629 0.2026 15.5108 36.1464 5.7589 8.7845 8.6309 20.2705 5.4881 39.5588 43.6311 30.9622 0.1251 30.0931 16.4351 91.5235 3.6365 48.3790 43.7714 22.2077 35.1995 19.7878 11.9702 30.4747 14.3554 40.4671 35.5073 7.9453 3.7150 11.0389 2.0762 15.1289 5.3639 6.4701 25.4639 34.8554 34.1824 38.0855 69.5703 12.1534 1.3115 1.1335 14.3538 14.7281 19.7081 3.4187 27.5385 12.1529 14.3416 6.8119 5.9799 15.5321 9.2701 17.9453 14.9205 3.6312 1.3063 5.4678 7.9907 124.0657 155.1445 0.8164 3.5959 146.1380 136.0099 31.0310 195.2994 32.9198 16.6468 37.6714 29.2696 23.5194 8.4059 34.0909 22.7784 22.5078 21.9787 18.6452 30.6666 15.3477 45.3295 58.8729 19.6713 24.8048 2.0642 2.5700 31.1933 14.2008 39.6901 83.0199
temp: 298.150 k
press: 1.00000 atm
elementType: 8 8 8 7 7 6 6 6 6 6 6 6 6 6 6 6 6 6 6 6 6 6 6 6 6 6 1 1 1 1 1 1 1 1 1 1 1 1 1 1 1 1 1 1 1 1 1 1 1 1 1 1
symmnumber: 1
zpe: 1135279.5 jmol-1
zpe.correction: 0.432405 hartree
zpe.thermalcorrener: 0.456738 hartree
zpe.thermalcorrenthalpy: 0.457682 hartree
zpe.thermalcorrgfe: 0.378876 hartree
zpe.sumelectzpe: -1149.075371 hartree
zpe.sumelectthermal: -1149.051039 hartree
zpe.sumelectthermalent: -1149.050095 hartree
zpe.sumelectthermalfe: -1149.128900 hartree
dipole: -0.8488 2.2014 3.1327
dipole: 3.9218
quadrupole: -144.0725 -144.5499 -159.8905
quadrupole: -5.1504 -3.6887 1.7365
quadrupole: 5.4318 4.9544 -10.3862 -5.1504 -3.6887 1.7365
hfenergy: -1149.5077764 hartree
pointgroup: C01 [X(C21H26N2O3)]
dipole: -0.4921194 0.8986856 1.1536317 debye
polarizability: 327.4503373|35.0843616|261.0977707|3.2031163|19.4847354|186.8604299 unknown
InChI: InChI=1S/C21H26N2O3/c1-4-12-11-23(2)17-9-15-13-7-5-6-8-16(13)22-20(15)18(24)10-14(12)19(17)21(25)26-3/h5-8,12,14,17,19,22H,4,9-11H2,1-3H3
charge 0 multiplicity 1
52 atoms
O  -2.959877 2.680693 0.332101
O  -2.972776 1.649065 -1.752874
O  0.59349 -2.710419 -1.429466
N  -0.451088 -0.664488 1.523163
N  2.694668 -0.981524 -0.933486
C  -2.222085 -0.92672 -0.553265
C  -2.290139 0.377809 0.276281
C  -2.169831 -2.133966 0.442409
C  -0.959031 0.645961 1.056402
C  -1.486777 -1.693199 1.770241
C  -1.087832 -0.960652 -1.632089
C  0.116239 1.477184 0.224519
C  -3.579415 -2.721865 0.701987
C  1.334691 0.727559 -0.23776
C  -2.754711 1.58836 -0.52081
C  0.298367 -1.479566 -1.236306
C  1.36006 -0.557871 -0.809403
C  0.553827 -0.545731 2.591604
C  -3.578452 -3.962631 1.623001
C  2.714984 1.110677 -0.024906
C  3.546264 0.015611 -0.475612
C  3.338365 2.270476 0.513641
C  4.957643 0.066654 -0.412824
C  -3.436067 3.926029 -0.319423
C  4.742294 2.320363 0.583368
C  5.543269 1.229822 0.123129
H  -3.166218 -0.98857 -1.128861
H  -3.077925 0.234407 1.045426
H  -1.544766 -2.924844 -0.014385
H  -1.225534 1.292507 1.927873
H  -2.260225 -1.346091 2.505729
H  -0.985311 -2.560207 2.235233
H  -1.00425 0.036406 -2.100547
H  -1.420506 -1.661973 -2.419489
H  0.444287 2.332367 0.842808
H  -0.403189 1.928661 -0.644156
H  -4.031094 -2.996791 -0.27228
H  -4.234044 -1.937123 1.139131
H  0.139666 -0.095592 3.527818
H  1.393256 0.084323 2.250748
H  0.959334 -1.543087 2.834892
H  -2.932031 -4.758674 1.208001
H  -3.208333 -3.721047 2.636252
H  -4.597418 -4.37697 1.73176
H  2.931019 -1.91031 -1.283355
H  2.737692 3.118622 0.862231
H  5.576822 -0.766102 -0.763544
H  -3.540898 4.649113 0.501293
H  -4.402134 3.74761 -0.820504
H  -2.701398 4.273103 -1.065456
H  5.235898 3.208793 0.992485
H  6.634721 1.302037 0.188874
