program: Gaussian 09
title: 000164861
version: EM64L-G09RevD.01
frameworkgroup: C1[X(C5H9NO3)]
method: RPBEPBE
basis: SDD
operation: Freq
keyword: #pfreq=noraman
keyword: PBEPBE/SDD
title: #p freq=noraman PBEPBE/SDD
converged: YES YES NO NO
title: Mulliken charges:
elementType: O O O N C C C C C H H H H H H H H H
charge: -0.236823 -0.252588 -0.258700 -0.068738 -0.292471 -0.579550 -0.015792 0.300936 -0.742852 0.247872 0.268861 0.256000 0.213951 0.243370 0.164515 0.244962 0.253926 0.253120
chargesum: 0.00000
title: Mulliken charges with hydrogens summed into heavy atoms:
elementType: O O O N C C C C C
charge: -0.236823 -0.252588 -0.258700 -0.068738 0.224263 0.133771 0.148723 0.300936 0.009155
polarizability: 8.89078873e+01 -6.66946048e+00 7.28930160e+01 -9.75942873e-01 1.09903797e-01 5.20087379e+01
1716.lowfreq: -20.8074 -7.4225 -0.0009 -0.0009 -0.0005 5.7858 12.5129 21.8379 59.7051
frequency: -17.3878 20.1622 59.6835 77.1742 104.1350 196.5728 201.6715 263.5102 306.4699 386.3824 395.2663 515.3245 573.9500 620.9042 623.4459 777.8729 871.6533 886.5628 964.5231 986.5253 1041.2055 1045.5127 1057.7009 1118.1318 1185.8777 1219.7649 1278.6135 1371.6799 1378.0549 1384.6462 1391.6723 1430.5224 1446.0170 1451.7300 1453.5049 1461.8693 1488.5757 1634.6114 1648.7650 2941.3386 2990.4139 3008.8910 3049.6496 3080.5997 3096.5903 3099.0203 3141.5796 3143.6161
redmass: 2.2567 1.2005 2.1960 3.2837 2.1245 4.2925 5.9463 2.7771 2.9100 2.6033 2.5941 3.9402 3.4064 5.0620 4.6729 5.0742 4.1898 7.6882 1.6044 1.8633 1.8542 1.7896 1.6921 1.3178 3.2744 2.2917 2.0025 1.4140 1.4444 1.2945 1.3375 1.0915 1.1985 1.0628 1.0498 1.0424 1.0806 6.6580 8.5723 1.0868 1.0335 1.0373 1.0587 1.1020 1.1011 1.0960 1.1082 1.1018
irintensity: 5.7569 0.9024 3.0419 4.9600 4.0167 2.4041 5.4166 6.1662 8.3639 7.6997 20.4649 14.2618 8.2271 3.2021 4.2481 22.2198 16.6959 244.7400 3.4919 94.6395 2.5781 22.9042 100.9709 0.6333 280.2417 81.2173 56.1122 60.0909 1.1181 38.0084 15.6201 28.0164 11.8436 27.1485 20.0000 18.7047 37.9249 369.4589 137.1766 86.7801 41.0623 1.5111 19.5855 23.2465 19.9522 6.5134 3.2959 9.2612
temp: 298.150 k
press: 1.00000 atm
elementType: 8 8 8 7 6 6 6 6 6 1 1 1 1 1 1 1 1 1
symmnumber: 1
zpe: 370076.4 jmol-1
zpe.correction: 0.140955 hartree
zpe.thermalcorrener: 0.150849 hartree
zpe.thermalcorrenthalpy: 0.151793 hartree
zpe.thermalcorrgfe: 0.103849 hartree
zpe.sumelectzpe: -475.642203 hartree
zpe.sumelectthermal: -475.632309 hartree
zpe.sumelectthermalent: -475.631365 hartree
zpe.sumelectthermalfe: -475.679309 hartree
dipole: -1.4063 2.1723 -0.9194
dipole: 2.7462
quadrupole: -56.5264 -57.8984 -50.0557
quadrupole: 15.2632 1.3183 -2.4533
quadrupole: -1.6995 -3.0716 4.7711 15.2632 1.3183 -2.4533
hfenergy: -475.7831576 hartree
pointgroup: C01 [X(C5H9N1O3)]
dipole: -0.381985 -0.9917603 0.1945755 debye
dipolederiv: -1.5416954 -0.3761865 0.1575285 -0.4113867 -0.5964164 0.0436777 0.4482689 0.0276013 -0.4507838 -0.5591983 -0.1063913 -0.0611382 -0.5465589 -1.1311099 -0.0916296 -0.0339608 0.0447689 -0.3700055 -0.6514397 -0.0246814 0.1246244 -0.2927027 -0.8006678 -0.207821 -0.0508484 -0.3343867 -0.5270651 -1.2299025 -0.4451877 -0.1185971 -0.0373805 -0.6829276 -0.0367001 -0.415841 -0.1723205 -0.471711 1.3852406 -0.0099848 -0.0399396 -0.4862014 0.140599 -0.0646526 -0.2466609 -0.0730577 0.5309622 0.0936534 -0.0094106 -0.0603676 -0.0030785 0.4419435 0.0202962 -0.0718338 -0.0064771 0.2135828 1.1503454 0.539484 0.3326526 0.7666095 1.3829747 0.107793 0.4168211 0.1355961 0.2760538 1.476824 0.364796 -0.3889099 0.7596556 1.1166025 0.2905774 -0.2187271 0.4171062 0.6000859 -0.2655415 0.0763192 0.1831058 0.1187222 -0.0643811 -0.1323326 0.2007076 -0.0825105 -0.12484 -0.0273493 -0.0144522 -0.048188 0.0359607 0.0774593 -0.1313268 0.0389552 -0.0300606 -0.0101642 0.0450587 -0.0273814 0.0575281 0.0535277 0.0199901 0.07745 0.0537615 0.007543 0.1073026 0.0129208 -0.0926497 0.1144698 -0.0388232 -0.0019293 -0.0005297 0.1161944 0.0410648 0.0118801 -0.0894026 0.1126602 -0.0895529 0.0080456 0.0753187 0.0092864 -0.091509 0.0522736 0.079956 0.1172668 -0.0379436 -0.0286568 -0.0231279 -0.0209327 -0.0433025 -0.0067558 -0.1142866 -0.0879949 -0.0669259 0.0931676 -0.0912203 0.1857477 -0.0941234 0.100418 -0.1122593 0.0675695 0.0688679 0.0137489 -0.0752424 0.0430152 -0.1147147 -0.0025443 0.0252529 0.0465356 -0.0083579 0.0981128 0.0706708 0.0599353 0.0000697 0.0707622 0.016788 0.0684011 -0.0332377 0.0766384 0.0764299 0.0657259 -0.0268506 -0.0864237 -0.0450569 0.1233567 -0.034858 -0.0396106 -0.0487042 -0.0206696 unknown
polarizability: 86.4753298|9.0890344|74.2733102|-1.1882616|4.2298563|53.0610011 unknown
InChI: InChI=1S/C5H9NO3/c1-5(8)9-4-6(2)3-7/h3H,4H2,1-2H3
charge 0 multiplicity 1
18 atoms
O  -0.764758 0.560694 0.2177
O  2.656043 1.669499 0.214066
O  -1.810446 -1.409798 -0.487192
N  1.482388 -0.339761 -0.15805
C  0.354477 0.331007 -0.764765
C  1.456385 -1.806483 0.001243
C  2.561632 0.417997 0.30351
C  -1.805591 -0.382758 0.229449
C  -2.883908 0.044028 1.199475
H  -0.044828 -0.263202 -1.603422
H  0.658806 1.346807 -1.053584
H  0.622779 -2.123979 0.650681
H  2.406131 -2.138073 0.454998
H  1.337795 -2.305059 -0.977145
H  3.352804 -0.221648 0.756621
H  -3.588293 -0.784436 1.362188
H  -3.43216 0.909259 0.785563
H  -2.438555 0.365505 2.155164
