program: Gaussian 09
title: 000164867
version: EM64L-G09RevD.01
frameworkgroup: C1[X(C10H9ClN4O2S)]
method: RPBEPBE
basis: SDD
operation: Freq
keyword: #p
keyword: freq=noraman
keyword: PBEPBE/SDD
title: #p freq=noraman PBEPBE/SDD
converged: YES YES NO NO
title: Mulliken charges:
elementType: Cl S O O N N N N C C C C C C C C C C H H H H H H H H H
charge: -0.029289 0.977175 -0.541247 -0.487667 -0.632463 -0.038581 -0.685329 0.093565 -0.089865 -0.223576 -0.147364 0.517785 -0.389098 -0.406421 0.344617 -0.390436 -0.251433 -0.140565 0.341248 0.284436 0.284274 0.233435 0.232950 0.248564 0.317211 0.317791 0.260282
chargesum: 0.00000
title: Mulliken charges with hydrogens summed into heavy atoms:
elementType: Cl S O O N N N N C C C C C C C C C C
charge: -0.029289 0.977175 -0.541247 -0.487667 -0.291215 -0.038581 -0.050327 0.093565 -0.089865 0.060860 0.136910 0.517785 -0.155663 -0.173471 0.344617 -0.141871 0.008849 -0.140565
polarizability: 2.61781286e+02 -2.91790247e-01 2.01420228e+02 1.59542214e+01 2.10306616e+01 1.19006897e+02
1716.lowfreq: -11.0836 -8.6495 -3.0959 0.0021 0.0022 0.0024 15.7128 38.2280 48.3493
frequency: 15.4307 38.1524 48.3395 52.6980 81.8589 107.0533 135.0933 153.6832 201.0466 216.3194 233.4245 274.5272 306.2169 312.6490 323.8456 378.8792 403.5977 406.1686 411.6007 416.0726 418.4049 436.9151 451.5336 468.8784 518.7853 523.3615 592.7835 606.4650 621.6820 661.9558 693.7276 718.3315 754.9946 801.4888 810.5785 816.0574 834.2336 853.6335 866.6347 909.6381 947.9869 950.2430 956.9885 964.7505 979.6178 1023.3319 1048.5808 1102.1373 1133.9419 1183.7829 1186.4290 1274.0939 1286.2299 1303.1879 1307.4143 1325.6720 1351.5542 1401.3355 1435.9514 1437.9861 1484.3221 1490.1335 1515.6851 1584.7422 1613.4228 1650.2250 3137.0673 3139.2787 3142.9851 3164.9227 3165.9869 3179.2202 3497.7762 3560.7178 3699.4681
redmass: 7.9459 4.5762 4.7942 11.3745 6.9408 7.8745 7.5235 6.4278 14.2755 10.8308 9.1832 7.8591 6.5474 6.7798 6.4446 8.7595 3.2459 8.8756 1.8376 1.2945 3.7967 2.0269 2.0564 1.7791 2.8043 5.0327 5.3178 8.3634 6.9058 5.7223 4.2966 2.9008 5.3532 6.1530 1.2932 8.5049 1.8368 6.5015 1.6626 1.3125 1.9643 2.7225 5.9430 1.4088 5.1649 1.4416 2.5159 4.0313 1.1959 1.7244 1.2093 2.6016 4.1071 1.2942 1.5049 2.5672 2.2965 5.4114 2.7864 3.6838 5.9503 2.9211 7.9200 7.3530 4.8525 1.2218 1.0897 1.0896 1.0926 1.0942 1.0960 1.0953 1.0780 1.0454 1.1040
irintensity: 1.2274 0.5456 0.8202 0.5586 1.6403 0.1180 0.6512 1.2941 1.5374 1.8038 11.6511 7.8537 25.6604 1.5975 10.1929 18.2316 7.7759 53.0185 0.4148 0.2836 3.0930 63.1898 388.8668 81.0205 20.9836 27.8969 22.0894 47.1709 0.7944 262.8079 46.1870 3.1761 0.6889 39.3857 1.6976 98.5974 84.1881 1.2265 29.1303 1.7275 18.7504 31.1951 52.7175 2.5668 10.4212 1.7760 68.5624 111.1711 12.5280 22.2000 36.7673 24.5466 1.6055 4.5182 12.2635 67.1630 118.3601 4.5908 337.1134 26.9830 16.8727 66.4974 55.0893 10.9031 191.4612 270.5496 11.8408 12.5386 12.3364 6.8613 6.4328 5.9942 57.7878 124.6366 26.6312
temp: 298.150 k
press: 1.00000 atm
elementType: 17 16 8 8 7 7 7 7 6 6 6 6 6 6 6 6 6 6 1 1 1 1 1 1 1 1 1
symmnumber: 1
zpe: 481520.3 jmol-1
zpe.correction: 0.183401 hartree
zpe.thermalcorrener: 0.200618 hartree
zpe.thermalcorrenthalpy: 0.201562 hartree
zpe.thermalcorrgfe: 0.136119 hartree
zpe.sumelectzpe: -1612.561591 hartree
zpe.sumelectthermal: -1612.544375 hartree
zpe.sumelectthermalent: -1612.543430 hartree
zpe.sumelectthermalfe: -1612.608873 hartree
dipole: -5.6045 5.4873 -2.7266
dipole: 8.3040
quadrupole: -112.9499 -110.4978 -120.6555
quadrupole: -27.7328 9.3425 10.6659
quadrupole: 1.7512 4.2033 -5.9544 -27.7328 9.3425 10.6659
hfenergy: -1612.7449927 hartree
pointgroup: C01 [X(C10H9Cl1N4O2S1)]
dipole: -2.1516046 2.4424947 -0.2798118 debye
polarizability: 262.769782|-5.2243087|182.800872|9.945628|40.4326729|136.6377574 unknown
InChI: InChI=1S/C10H9ClN4O2S/c11-9-5-14-10(6-13-9)15-18(16,17)8-3-1-7(12)2-4-8/h1-6,15H,12H2
charge 0 multiplicity 1
27 atoms
Cl 5.514477 1.486217 0.345776
S  -0.780321 -1.893506 -0.080513
O  -1.604763 -2.915644 -1.042271
O  -0.176632 -2.371618 1.3436
N  0.634772 -1.455753 -1.268834
N  1.71678 0.018585 0.227206
N  -4.071083 3.115209 0.641303
N  4.12613 -0.253197 -1.229727
C  -1.754994 -0.330149 0.125688
C  -2.824134 -0.103847 -0.761198
C  -1.428191 0.543425 1.178725
C  -3.303427 1.972433 0.469506
C  -3.599328 1.053582 -0.585558
C  -2.209906 1.696289 1.349577
C  1.791655 -0.811292 -0.866001
C  3.022561 -0.95151 -1.590524
C  2.838862 0.694966 0.584422
C  4.03289 0.555958 -0.160373
H  0.664666 -2.167557 -2.009875
H  -3.051431 -0.827856 -1.549947
H  -0.581082 0.3216 1.833498
H  -4.440789 1.250371 -1.25935
H  -1.978547 2.391937 2.164007
H  3.112347 -1.614265 -2.457154
H  -4.852408 3.318247 0.024014
H  -3.871656 3.770895 1.391677
H  2.780652 1.342982 1.462929
