program: Gaussian 09
title: 000164884
version: EM64L-G09RevD.01
frameworkgroup: C1[X(C22H28N4O2)]
method: RPBEPBE
basis: SDD
operation: Freq
keyword: #p
keyword: freq=noraman
keyword: PBEPBE/SDD
title: #p freq=noraman PBEPBE/SDD
converged: YES YES NO NO
title: Mulliken charges:
elementType: O O N N N N C C C C C C C C C C C C C C C C C C C C C C H H H H H H H H H H H H H H H H H H H H H H H H H H H H
charge: -0.291323 -0.291326 -0.397259 -0.397262 -0.100408 -0.100399 0.049525 0.049515 0.350655 0.350657 0.290944 0.290954 -0.174414 -0.174410 -0.403429 -0.403426 -0.450808 -0.450809 -0.380844 -0.380844 -0.379169 -0.379181 -0.229729 -0.229728 -0.601927 -0.618762 -0.601928 -0.618761 0.222297 0.221165 0.222301 0.221160 0.420265 0.420264 0.293003 0.293003 0.242450 0.242449 0.184322 0.226872 0.184323 0.226872 0.227438 0.227438 0.227262 0.186146 0.229635 0.186943 0.229461 0.239691 0.229633 0.227262 0.186146 0.186941 0.229459 0.239693
chargesum: 0.00000
title: Mulliken charges with hydrogens summed into heavy atoms:
elementType: O O N N N N C C C C C C C C C C C C C C C C C C C C C C
charge: -0.291323 -0.291326 0.023006 0.023002 -0.100408 -0.100399 0.049525 0.049515 0.350655 0.350657 0.290944 0.290954 -0.174414 -0.174410 0.040033 0.040035 -0.157805 -0.157806 -0.138394 -0.138396 0.032025 0.032014 -0.002290 -0.002290 0.041117 0.037332 0.041114 0.037332
polarizability: 4.61818933e+02 4.44284275e+01 3.55147402e+02 1.19583244e-02 3.07632037e-02 1.57137554e+02
1716.lowfreq: -5.6005 -0.8702 0.0005 0.0007 0.0009 7.5130 17.9997 29.1454 34.2033
frequency: 17.9370 28.8246 34.1978 39.3683 43.0644 48.6567 51.7935 67.8691 81.9459 100.0908 123.9256 148.8437 149.0725 178.1652 199.0933 207.2717 209.1219 220.8363 224.6514 244.9503 251.0652 252.0421 268.4684 286.9281 289.4491 301.3998 311.9654 348.0996 349.4365 361.2428 389.7942 403.3038 414.8631 416.2322 422.4846 429.5571 464.9324 484.4177 489.8660 514.7381 526.8276 545.0845 560.0431 593.2083 646.7428 662.5336 674.2751 699.4230 711.0291 759.4553 761.0824 767.6141 769.6137 781.4572 809.8720 829.1945 844.0958 864.6622 881.5561 881.7703 898.4574 901.1106 910.1556 924.6586 957.0987 961.3466 970.0027 989.4302 989.6139 1029.6331 1040.3620 1040.3749 1059.0714 1059.0773 1066.1857 1066.1891 1072.5703 1085.2868 1092.3441 1092.8600 1120.6612 1123.3505 1148.5809 1149.1547 1163.5036 1178.7557 1182.5462 1184.7676 1197.7522 1202.3745 1241.3090 1244.4913 1268.8038 1270.9449 1278.5372 1279.1623 1290.4246 1292.3392 1316.0273 1320.6031 1360.6778 1365.7540 1374.1144 1374.5507 1380.0016 1403.7499 1406.6695 1420.1210 1420.2336 1423.5201 1430.2779 1442.1383 1442.9154 1444.8323 1461.7561 1461.7695 1461.8987 1462.0998 1474.0882 1474.1603 1475.5212 1475.7977 1486.1576 1486.1785 1487.9236 1487.9455 1496.8483 1506.7779 1530.5524 1531.0292 1567.1843 1577.7005 1605.3018 1622.6959 2843.4013 2843.4122 2852.5726 2852.5826 2868.2528 2868.7762 2931.5297 2931.9630 2987.3216 2987.3586 3024.7573 3024.7650 3030.3360 3030.3747 3032.5577 3032.5723 3083.0049 3083.0145 3087.3891 3087.4019 3131.6867 3131.7883 3162.9589 3163.0687 3174.1738 3174.8805 3232.1357 3233.4278
redmass: 4.3409 3.9749 3.1713 3.3724 3.4389 3.2602 3.6911 4.8001 4.4603 4.1519 3.7723 4.5027 6.0767 6.6849 3.8787 1.4453 1.2696 1.2799 1.1748 3.0542 2.3455 3.0046 2.8665 2.1141 2.5468 2.8902 3.5991 5.0527 2.3821 2.6285 5.4469 3.3045 2.1479 2.2866 8.8625 5.2563 9.3995 3.7457 5.6175 3.6936 3.6791 4.8539 4.1906 5.6531 4.5518 5.0905 3.3488 5.5000 2.3586 2.6057 3.2602 5.4904 5.3117 1.5673 1.9062 3.7809 2.4662 3.1627 1.1794 1.1059 2.6583 4.0866 1.4202 1.8791 2.4940 2.2275 2.8002 1.3587 1.3508 3.9979 1.4815 1.4785 1.8186 1.8077 2.1070 2.1314 1.9385 1.7550 1.3233 1.3541 2.0322 1.8489 2.2919 2.0320 1.7479 1.3033 1.5863 1.6088 1.8076 1.4278 1.4119 1.4349 1.8796 1.8258 2.5153 2.5920 1.6333 1.6699 1.7859 2.5144 1.7617 1.4661 1.3696 1.3841 2.6062 5.3990 4.4628 1.1734 1.1427 3.0170 6.5554 1.2570 1.1791 3.0574 1.0591 1.0578 1.0660 1.0694 1.0597 1.0590 1.1133 1.0987 1.0565 1.0554 1.2440 1.1132 2.9863 2.7780 3.9181 3.0975 4.4190 6.0931 6.5012 7.3750 1.0691 1.0691 1.0570 1.0570 1.0583 1.0584 1.0649 1.0650 1.0943 1.0942 1.0726 1.0726 1.0859 1.0860 1.0756 1.0756 1.1012 1.1012 1.1006 1.1006 1.0873 1.0874 1.0924 1.0924 1.0960 1.0960 1.0804 1.0803
irintensity: 0.8365 0.5801 2.4029 0.2086 0.6467 0.5449 0.9795 1.6292 0.0262 1.1847 0.3676 0.1066 0.1381 0.0949 0.2059 0.6567 0.2384 0.0280 0.4420 0.0496 0.0019 1.0367 1.5347 2.9219 15.4279 0.0012 1.1760 0.1082 40.4342 0.0316 0.0331 36.8506 0.5605 1.8397 10.6693 0.0217 0.2557 2.9889 0.0008 0.7348 0.8658 3.9773 0.0103 1.2730 11.6605 0.0298 0.0387 0.5067 54.3245 65.2443 3.1501 7.0861 3.4233 9.0480 103.2032 8.2180 8.3207 0.3779 97.0992 1.2345 19.6590 9.0149 16.9600 0.2274 5.0438 23.7480 1.9458 0.1314 4.1044 33.3293 21.2212 12.0064 51.9440 1.2418 27.3472 10.4427 5.1457 4.1832 12.1069 7.2881 3.5176 30.9947 9.6088 1.4812 22.6243 0.4291 3.4113 2.6405 0.0303 91.2849 0.0001 99.3438 6.9428 114.1386 62.5891 7.8016 71.2397 9.4326 1.8448 566.9682 31.9693 0.6256 0.9999 15.2780 115.5498 0.0104 36.1850 4.7950 10.4164 0.0964 0.0171 14.2569 2.4747 25.4386 20.8165 4.8775 33.2111 12.4500 42.7608 2.4422 2.0473 3.8391 9.7080 18.4231 6.9828 264.6120 1.1318 432.1896 119.1416 0.1440 0.0799 369.0622 437.6658 0.0034 100.2719 25.4509 43.4863 96.7832 727.1917 4.4019 252.5775 19.5350 38.0521 34.0063 8.2249 49.2427 1.9211 96.7218 44.2133 2.8525 0.6189 40.5368 69.5204 14.3359 35.9486 0.0040 37.5106 0.0130 25.4212 0.0009 1.4734 151.3042
temp: 298.150 k
press: 1.00000 atm
elementType: 8 8 7 7 7 7 6 6 6 6 6 6 6 6 6 6 6 6 6 6 6 6 6 6 6 6 6 6 1 1 1 1 1 1 1 1 1 1 1 1 1 1 1 1 1 1 1 1 1 1 1 1 1 1 1 1
symmnumber: 1
zpe: 1219053.5 jmol-1
zpe.correction: 0.464313 hartree
zpe.thermalcorrener: 0.491601 hartree
zpe.thermalcorrenthalpy: 0.492545 hartree
zpe.thermalcorrgfe: 0.405006 hartree
zpe.sumelectzpe: -1222.533863 hartree
zpe.sumelectthermal: -1222.506575 hartree
zpe.sumelectthermalent: -1222.505631 hartree
zpe.sumelectthermalfe: -1222.593170 hartree
dipole: -0.0001 -0.0001 0.3157
dipole: 0.3157
quadrupole: -112.4745 -154.7654 -168.1191
quadrupole: 12.9097 0.0018 0.0028
quadrupole: 32.6452 -9.6457 -22.9995 12.9097 0.0018 0.0028
hfenergy: -1222.998176 hartree
pointgroup: C01 [X(C22H28N4O2)]
dipole: 0.0000296 -0.0000265 -0.1242236 debye
polarizability: 463.7288712|-42.0297663|353.237464|0.0126348|-0.0304916|157.1375536 unknown
InChI: InChI=1S/C22H28N4O2/c1-25(2)13-11-23-17-9-5-7-15-19(17)21(27)16-8-6-10-18(20(16)22(15)28)24-12-14-26(3)4/h5-10,23-24H,11-14H2,1-4H3
charge 0 multiplicity 1
56 atoms
O  2.325026 1.493827 0.006761
O  -2.324858 -1.49433 0.006973
N  3.761909 -0.713513 0.066692
N  -3.761736 0.71301 0.066373
N  6.033346 0.920008 -0.469953
N  -6.033167 -0.920683 -0.46989
C  1.303191 -0.694279 0.027811
C  -1.30302 0.693776 0.02754
C  0.08399 -1.447153 0.021049
C  -0.083821 1.446649 0.020598
C  2.573658 -1.400867 0.037569
C  -2.573488 1.400362 0.037041
C  1.253094 0.770318 0.01919
C  -1.252924 -0.770822 0.019367
C  5.081815 -1.341214 0.062042
C  -5.081644 1.340701 0.061433
C  0.102055 -2.855925 0.014495
C  -0.101889 2.855419 0.013616
C  2.553685 -2.837233 0.018697
C  -2.55352 2.836722 0.017718
C  6.161208 -0.283406 0.375273
C  -6.161047 0.282992 0.374962
C  1.341207 -3.53981 0.009302
C  -1.341043 3.539299 0.008154
C  6.749747 2.088384 0.075867
C  6.328574 0.686453 -1.89609
C  -6.749626 -2.088871 0.076258
C  -6.328332 -0.687555 -1.89611
H  5.286866 -1.833535 -0.914175
H  5.146326 -2.133615 0.835644
H  -5.286648 1.832689 -0.914962
H  -5.146199 2.133366 0.834762
H  3.706573 0.323118 0.001581
H  -3.706388 -0.323648 0.001694
H  -0.853179 -3.387058 0.008617
H  0.853343 3.386552 0.007617
H  3.497034 -3.390359 0.004833
H  -3.496871 3.38984 0.00366
H  7.165747 -0.773184 0.285664
H  6.043261 0.037075 1.42751
H  -7.165582 0.772746 0.285171
H  -6.043131 -0.037163 1.427302
H  1.357258 -4.635537 -0.004711
H  -1.357096 4.635022 -0.006195
H  6.517847 2.979764 -0.533422
H  7.862234 1.962561 0.093228
H  6.408789 2.285597 1.107516
H  7.388426 0.375434 -2.081243
H  6.137593 1.61354 -2.464168
H  5.663378 -0.09377 -2.304149
H  -6.408709 -2.285785 1.107977
H  -6.517734 -2.980443 -0.532755
H  -7.862109 -1.963005 0.093544
H  -7.388158 -0.376527 -2.081396
H  -6.137391 -1.614832 -2.463891
H  -5.663072 0.092498 -2.30439
