program: Gaussian 09
title: 000164855
version: EM64L-G09RevD.01
frameworkgroup: C1[X(C4HClF8)]
method: RPBEPBE
basis: SDD
operation: Freq
keyword: #p
keyword: freq=noraman
keyword: PBEPBE/SDD
title: #p freq=noraman PBEPBE/SDD
converged: YES YES NO NO
title: Mulliken charges:
elementType: Cl F F F F F F F F C C C C H
charge: 0.103509 -0.110067 -0.111643 -0.130176 -0.136388 -0.126336 -0.134729 -0.133979 -0.125607 -0.332476 0.059268 0.408145 0.415600 0.354881
chargesum: 0.00000
title: Mulliken charges with hydrogens summed into heavy atoms:
elementType: Cl F F F F F F F F C C C C
charge: 0.103509 -0.110067 -0.111643 -0.130176 -0.136388 -0.126336 -0.134729 -0.133979 -0.125607 0.022405 0.059268 0.408145 0.415600
polarizability: 5.58940680e+01 -7.75155856e-01 5.18193476e+01 -5.52343780e+00 2.01845470e+00 5.81713510e+01
1716.lowfreq: -13.6703 -2.0147 0.0016 0.0018 0.0018 8.1600 47.8765 63.2265 71.5530
frequency: 47.7869 63.2115 71.5099 139.0302 155.1863 158.2491 226.6926 257.6790 272.9261 283.6824 295.7280 298.5827 383.3369 385.6967 446.4061 466.5382 466.6529 480.1420 558.4078 611.0465 641.3439 670.1861 812.3940 841.2068 932.9195 956.3686 975.5735 1060.3868 1076.1221 1097.7686 1129.5283 1179.5959 1183.1147 1316.5729 1326.8359 3054.1922
redmass: 19.4994 21.8829 18.7466 22.3580 17.5733 17.1643 18.4383 18.6229 16.6289 19.1508 18.3014 18.3572 22.8295 17.9932 16.6374 16.8468 17.2834 14.6183 17.3698 12.4349 10.6364 7.8208 6.5249 5.4997 12.0589 11.8795 6.5628 12.0231 12.2788 7.9306 7.7421 6.7415 7.5418 1.4514 1.4835 1.0827
irintensity: 0.1137 0.0818 0.0498 1.8107 0.9709 1.9003 1.4438 0.0312 0.1763 0.1222 0.6115 0.1803 0.8186 1.4192 9.4743 6.6067 5.7986 0.3477 12.8240 44.8370 28.4551 63.2543 34.6309 58.7620 105.7438 17.7764 117.6887 66.3336 51.0317 498.2514 151.6489 255.2997 217.2662 72.2228 97.4866 8.5537
temp: 298.150 k
press: 1.00000 atm
elementType: 17 9 9 9 9 9 9 9 9 6 6 6 6 1
symmnumber: 1
zpe: 145481.5 jmol-1
zpe.correction: 0.055411 hartree
zpe.thermalcorrener: 0.068039 hartree
zpe.thermalcorrenthalpy: 0.068983 hartree
zpe.thermalcorrgfe: 0.015542 hartree
zpe.sumelectzpe: -1410.796445 hartree
zpe.sumelectthermal: -1410.783818 hartree
zpe.sumelectthermalent: -1410.782873 hartree
zpe.sumelectthermalfe: -1410.836315 hartree
dipole: -0.1237 0.0886 -1.0500
dipole: 1.0610
quadrupole: -82.2294 -83.6919 -76.1596
quadrupole: -0.2882 -3.0162 0.1168
quadrupole: -1.5357 -2.9983 4.5340 -0.2882 -3.0162 0.1168
hfenergy: -1410.8518564 hartree
pointgroup: C01 [X(C4H1Cl1F8)]
dipole: 0.1002152 0.0538829 0.4016245 debye
dipolederiv: -0.1606377 -0.0345232 0.1515835 -0.0185545 -0.1134313 0.12389 0.0951536 0.130479 -0.5323218 -0.3870947 0.2154405 -0.0471052 0.0954766 -0.732425 0.1852259 0.0025642 0.1313275 -0.3456793 -0.4522953 -0.1879447 -0.1808512 -0.1015614 -0.4262033 -0.2225612 -0.1021262 -0.2002009 -0.5973371 -0.4800822 -0.154316 -0.0322454 -0.2418477 -0.6603376 -0.0727897 -0.0367189 -0.0198664 -0.2616781 -0.6298887 0.0744461 0.2442839 0.1612726 -0.3536273 -0.0687457 0.2206152 -0.0112978 -0.4374443 -0.3432888 0.0291485 -0.1572825 0.0551146 -0.3430749 0.0271986 -0.1454831 -0.0351253 -0.6736323 -0.8130277 0.0679796 0.0589489 -0.0232748 -0.3508152 -0.0023319 -0.003139 -0.0275689 -0.257978 -0.312897 -0.0022219 -0.0465603 0.073452 -0.6625135 0.2375668 -0.092599 0.188896 -0.437305 -0.3265653 -0.0358313 0.0766808 -0.02085 -0.3622139 -0.1513759 0.1116442 -0.1146489 -0.67457 -0.3744405 0.0203764 -0.0520847 -0.0227969 -0.3972091 0.0185681 0.0668647 0.0050522 -0.2846613 1.2160745 -0.0082561 0.100211 0.0338292 1.2698975 -0.1068584 -0.1244474 -0.0987109 1.6048386 1.482629 -0.0321569 -0.0668036 -0.0631415 1.4998727 0.111205 0.0021551 0.0337993 1.4071118 1.4996253 0.0620054 -0.0792857 0.0687608 1.5156236 -0.0824358 0.004296 0.0183187 1.4065604 0.0818891 -0.0141465 0.0305102 0.004121 0.1164574 0.0034442 0.0012207 -0.0004534 0.0840964 unknown
polarizability: 54.0407596|0.9446418|52.1358922|-4.4192459|-3.0989022|59.7081148 unknown
InChI: InChI=1S/C4HClF8/c5-2(6,7)1(3(8,9)10)4(11,12)13/h1H
charge 0 multiplicity 1
14 atoms
Cl 1.928836 0.407765 -1.583355
F  1.994865 -1.351549 0.401808
F  2.181363 0.811745 1.030953
F  0.118878 2.419443 0.243635
F  -1.854238 1.528277 0.881138
F  -1.146013 1.297686 -1.264385
F  -2.183867 -1.072309 0.092873
F  -0.48789 -2.374881 0.816122
F  -0.499758 -1.614828 -1.320883
C  -0.021331 -0.011676 0.496014
C  1.494044 -0.053814 0.1478
C  -0.722074 1.307518 0.07368
C  -0.792837 -1.267416 0.004373
H  -0.07028 -0.040461 1.600528
