program: Gaussian 09
title: 000164851
version: EM64L-G09RevD.01
frameworkgroup: C1[X(C7H14N2)]
method: RPBEPBE
basis: SDD
operation: Freq
keyword: #pfreq=noraman
keyword: PBEPBE/SDD
title: #p freq=noraman PBEPBE/SDD
converged: YES YES NO NO
title: Mulliken charges:
elementType: N N C C C C C C C H H H H H H H H H H H H H H
charge: -0.099003 -0.062469 -0.355830 -0.413743 -0.415467 -0.380843 -0.350844 -0.434181 -0.446870 0.140457 0.237140 0.208457 0.240181 0.241013 0.211829 0.229082 0.174368 0.166270 0.238944 0.231126 0.205302 0.205502 0.229580
chargesum: 0.00000
title: Mulliken charges with hydrogens summed into heavy atoms:
elementType: N N C C C C C C C
charge: -0.099003 -0.062469 0.021767 0.034895 0.037374 0.022607 0.054370 0.002247 -0.011788
polarizability: 1.05987233e+02 -3.14164350e-01 8.49835846e+01 -1.90278399e-01 -2.43871052e-02 6.85963606e+01
1716.lowfreq: -22.3307 -6.9392 -1.0231 0.0007 0.0011 0.0011 27.4687 70.2249 89.6398
frequency: 10.6883 70.2131 89.5307 118.4714 205.3105 288.6297 315.3946 349.1749 403.5860 621.2839 637.9288 719.5745 757.2128 795.1102 823.2207 852.5569 862.9872 897.4574 960.8814 966.6442 973.4399 990.9861 1047.6434 1059.5140 1065.6080 1072.1914 1092.9445 1117.2607 1136.2145 1145.2266 1161.9212 1190.5854 1194.2121 1230.6274 1242.2512 1255.7800 1263.8671 1284.6373 1290.3111 1321.2574 1341.6873 1387.6048 1450.1846 1457.9743 1464.8267 1473.9468 1478.8049 1479.4169 1495.1320 2669.9172 2811.2539 2831.8919 3012.0162 3020.8875 3023.7323 3034.3296 3047.1666 3056.5857 3058.9778 3068.9212 3093.3369 3162.2169 3179.1918
redmass: 1.7821 2.3031 3.1141 3.0169 2.3637 2.6820 2.8283 2.9668 2.2856 2.9387 2.9623 3.0314 1.4357 1.8679 2.1961 1.6902 2.3836 2.6576 2.0812 1.6789 1.1359 1.7612 1.7745 1.2747 2.4613 1.3288 1.5350 1.9979 1.6687 1.7576 1.8888 1.3753 1.3593 1.1710 2.1442 3.4099 1.2832 1.2151 1.3295 1.3815 1.4841 1.3180 1.0857 1.0829 1.0814 1.1708 1.0883 1.0828 1.1056 1.0689 1.0712 1.0715 1.0595 1.0849 1.0698 1.0805 1.0516 1.0630 1.0908 1.1021 1.1052 1.1129 1.1143
irintensity: 0.4964 1.3462 2.3325 1.7046 0.5897 3.9174 2.3581 1.0825 7.0091 0.8828 0.2716 12.9549 0.1583 3.1456 3.5043 5.2344 16.9899 7.1063 6.1378 15.0871 1.9410 19.1422 3.4671 11.4984 5.8270 11.7624 0.0897 44.0220 5.5686 42.1299 24.0004 8.0514 6.2606 6.8973 30.6644 36.3414 9.0402 2.3385 5.8016 9.3340 16.5918 43.2654 1.0746 4.4955 2.6660 4.9803 12.7633 0.2495 3.1701 139.1935 78.3966 172.9449 23.6396 10.8167 77.2452 63.1254 35.1829 34.8575 14.9374 4.3725 74.1652 1.9447 41.2029
temp: 298.150 k
press: 1.00000 atm
elementType: 7 7 6 6 6 6 6 6 6 1 1 1 1 1 1 1 1 1 1 1 1 1 1
symmnumber: 1
zpe: 532232.6 jmol-1
zpe.correction: 0.202717 hartree
zpe.thermalcorrener: 0.212163 hartree
zpe.thermalcorrenthalpy: 0.213107 hartree
zpe.thermalcorrgfe: 0.166072 hartree
zpe.sumelectzpe: -383.830219 hartree
zpe.sumelectthermal: -383.820773 hartree
zpe.sumelectthermalent: -383.819829 hartree
zpe.sumelectthermalfe: -383.866863 hartree
dipole: 0.1375 -0.0223 2.3188
dipole: 2.3230
quadrupole: -51.8401 -53.2455 -59.4288
quadrupole: 0.0566 -1.7069 -0.6595
quadrupole: 2.9981 1.5926 -4.5907 0.0566 -1.7069 -0.6595
hfenergy: -384.0329355 hartree
pointgroup: C01 [X(C7H14N2)]
dipole: -0.0471682 0.0161479 0.9125783 debye
dipolederiv: -0.7442455 0.2199027 -0.0513329 0.3317025 -0.1719926 -0.0091668 -0.0299461 -0.0082833 -0.3538789 -0.9041587 -0.0121166 0.0048824 -0.1074497 -0.463173 0.0102408 -0.0718788 -0.0186375 -0.5553086 1.132141 -0.0260816 0.0727135 -0.013804 0.2806062 0.0194628 -0.0223705 0.066857 0.5878244 0.1109454 -0.0261416 -0.057272 -0.0681884 -0.0044142 0.0262341 -0.0355222 0.0326739 0.2099679 0.0938775 -0.0735219 -0.0086977 -0.0825219 0.0528175 0.094798 0.0172073 0.0769016 0.151582 0.3282143 -0.1901323 -0.0713118 -0.2718691 0.2563204 0.0290135 -0.0347805 0.1091423 0.4364614 0.0718948 0.048349 -0.0114161 0.0980671 0.3499623 -0.0695391 0.0239703 -0.1020953 0.4202447 0.0472179 -0.0297991 -0.0271534 -0.0417663 -0.0242067 -0.0167527 -0.026996 -0.052467 0.1507674 -0.0133977 0.0323562 -0.0342531 0.0549083 0.0639584 -0.0069358 -0.0504277 0.0176625 0.1525968 -0.1964968 -0.0033457 -0.0228161 0.0362578 0.0055342 0.0408357 -0.0851288 -0.1175464 -0.3469659 -0.00359 0.0048715 -0.0031176 -0.0060044 -0.156742 0.039359 0.0091288 0.0502234 0.0494876 0.0301047 -0.0171705 0.0260512 -0.0547562 0.0128522 -0.1146216 -0.0813474 -0.1340994 -0.0699344 -0.0965504 -0.0452784 0.0821394 -0.0594362 0.084327 -0.0128597 0.116806 0.0020492 0.0192778 0.094471 0.0299084 0.0266671 0.0733835 -0.0999906 -0.0461834 0.0407653 -0.0695728 0.0412539 0.0891356 -0.0046782 0.1016621 0.0015141 0.0199034 0.0111236 0.0614224 0.0868973 -0.119928 0.0577649 -0.0141371 0.0062241 0.0392153 -0.1608907 0.0731178 0.0109033 0.1001661 0.0197763 -0.0480147 0.0111315 -0.0473601 0.0476267 -0.0054342 -0.0365382 0.0956656 -0.167569 -0.2793717 -0.0022858 -0.0013977 -0.0769661 -0.0403342 -0.0330285 -0.0082094 -0.0498473 0.1528017 -0.2719075 0.0095959 0.1228466 0.0367871 0.0999797 -0.0565884 -0.0455091 0.0639057 -0.0446273 0.0231359 0.0063229 0.0182562 -0.0711666 0.0262697 0.0384512 0.0385757 -0.1371532 0.0542819 -0.1025643 -0.1038606 0.0419787 0.0963767 0.0374238 0.0553408 -0.0248477 0.1605689 -0.03995 -0.0317599 -0.0001973 -0.075311 0.0557718 -0.0821985 -0.0475809 0.0828623 0.0983073 0.1287373 -0.0292411 0.0411115 -0.0104892 -0.0264118 -0.0180196 0.0039679 -0.0744601 -0.0732524 -0.1235463 -0.1015163 unknown
polarizability: 105.9903305|-0.2216964|84.9805213|-0.0930128|-0.1098398|68.5963263 unknown
InChI: InChI=1S/C7H14N2/c1-2-4-8(3-1)7-9-5-6-9/h1-7H2
charge 0 multiplicity 1
23 atoms
N  1.861469 0.135964 -0.561627
N  -0.541615 0.367592 -0.220613
C  0.777274 0.884994 0.135527
C  3.237267 0.354361 0.021587
C  2.518648 -0.966115 0.240297
C  -1.676061 1.20697 0.236551
C  -0.850561 -1.007403 0.238893
C  -2.91872 0.319308 -0.038339
C  -2.370093 -1.149109 -0.04028
H  0.935557 0.869822 1.261526
H  0.83741 1.937732 -0.19886
H  3.334033 1.017934 0.893711
H  4.047355 0.431644 -0.709756
H  2.804939 -1.852358 -0.334171
H  2.138663 -1.16666 1.252883
H  -1.698867 2.165455 -0.312876
H  -1.60859 1.440379 1.332089
H  -0.643382 -1.128344 1.336491
H  -0.2394 -1.745633 -0.306018
H  -3.355426 0.564411 -1.021052
H  -3.699547 0.47577 0.726416
H  -2.859687 -1.78391 0.718857
H  -2.534667 -1.616405 -1.025835
