program: Gaussian 09
title: 000164850
version: EM64L-G09RevD.01
frameworkgroup: C1[X(C7H16N2)]
method: RPBEPBE
basis: SDD
operation: Freq
keyword: #pfreq=noraman
keyword: PBEPBE/SDD
title: #p freq=noraman PBEPBE/SDD
converged: YES YES NO NO
title: Mulliken charges:
elementType: N N C C C C C C C H H H H H H H H H H H H H H H H
charge: -0.097743 -0.105369 -0.419700 -0.400087 -0.363848 -0.316423 -0.323380 -0.678404 -0.676308 0.206011 0.236903 0.235716 0.220471 0.213191 0.174498 0.175966 0.248847 0.183825 0.208020 0.206279 0.229613 0.201014 0.229709 0.203215 0.207985
chargesum: 0.00000
title: Mulliken charges with hydrogens summed into heavy atoms:
elementType: N N C C C C C C C
charge: -0.097743 -0.105369 0.023214 0.056100 0.023841 0.108390 0.068464 -0.041498 -0.035400
polarizability: 1.02523477e+02 -4.52882196e-02 8.85322323e+01 -9.31854232e-01 -8.98693300e-01 8.10185792e+01
1716.lowfreq: -20.3624 -14.8428 -7.8389 -0.0006 -0.0005 0.0002 44.7335 60.6947 65.4979
frequency: 44.5603 60.6588 65.2439 85.6993 156.4242 197.0670 219.4038 267.9181 273.5048 322.6144 351.6665 414.3254 455.4537 504.3265 727.6460 747.6112 791.3994 797.5472 804.0221 829.4803 913.5496 967.0622 982.6518 1005.0600 1043.1579 1062.8545 1067.4759 1073.1129 1079.3418 1085.9218 1107.0310 1126.7517 1140.6105 1190.4933 1211.2911 1253.4911 1269.3132 1286.9137 1295.4142 1365.9413 1374.1195 1382.5544 1384.5677 1387.7535 1456.2694 1460.5054 1463.5830 1470.4468 1472.8301 1477.4017 1480.9948 1486.2614 1490.9608 2847.2724 2851.8357 2865.6511 2922.6671 2980.1074 2982.1327 3037.5343 3046.3884 3052.3358 3065.7945 3072.5282 3074.9589 3091.4125 3091.9264 3162.7860 3181.2306
redmass: 2.7158 2.7891 2.0473 2.3234 1.5341 1.4315 1.6442 1.9569 1.9295 2.8074 2.2965 2.2952 2.7373 3.1138 2.4828 2.7299 1.1340 1.5175 1.2139 3.6080 1.9135 1.4867 1.5833 1.9527 1.6621 1.3525 1.9787 1.4406 2.0274 1.9285 1.8913 1.6545 1.4753 2.1386 2.2776 2.0046 1.7150 1.1940 1.2576 1.3296 1.2890 1.2797 1.2299 1.2964 1.0804 1.0641 1.0532 1.0679 1.1062 1.0702 1.0957 1.0662 1.0739 1.0702 1.0671 1.0669 1.0959 1.0358 1.0356 1.0870 1.0899 1.0525 1.0603 1.0975 1.0975 1.1002 1.1002 1.1141 1.1152
irintensity: 1.1414 1.3717 1.0786 2.1931 1.4771 0.5765 0.6779 2.8930 0.9265 2.0561 0.7218 6.8986 1.2677 6.1365 6.5160 10.7919 6.2071 3.5836 9.0306 1.1388 1.0236 14.3313 38.9854 6.6999 15.6350 3.5027 27.7583 27.0818 29.1560 10.1967 10.4640 8.5520 0.8455 32.4485 47.1615 34.7208 12.3008 14.8287 28.8738 7.1384 5.3228 21.4749 24.1843 14.3672 1.6812 7.7284 5.3260 3.9707 0.8929 0.8655 8.2438 13.4368 13.9601 28.2158 44.6335 264.0276 63.2162 35.4837 31.7960 11.8966 0.2685 40.9878 27.6780 39.0548 82.6344 26.1871 51.8208 3.4432 44.1478
temp: 298.150 k
press: 1.00000 atm
elementType: 7 7 6 6 6 6 6 6 6 1 1 1 1 1 1 1 1 1 1 1 1 1 1 1 1
symmnumber: 1
zpe: 584727.6 jmol-1
zpe.correction: 0.222711 hartree
zpe.thermalcorrener: 0.234024 hartree
zpe.thermalcorrenthalpy: 0.234969 hartree
zpe.thermalcorrgfe: 0.185019 hartree
zpe.sumelectzpe: -385.007168 hartree
zpe.sumelectthermal: -384.995854 hartree
zpe.sumelectthermalent: -384.994910 hartree
zpe.sumelectthermalfe: -385.044859 hartree
dipole: 0.0014 1.4209 -0.4915
dipole: 1.5035
quadrupole: -54.2564 -57.7491 -57.5549
quadrupole: 1.4305 0.7334 -0.9462
quadrupole: 2.2638 -1.2290 -1.0348 1.4305 0.7334 -0.9462
hfenergy: -385.2298788 hartree
pointgroup: C01 [X(C7H16N2)]
dipole: 0.0053883 -0.548352 -0.221804 debye
dipolederiv: -0.7856238 -0.0025249 0.244884 0.0232773 -0.3658118 0.0448377 0.3687172 0.033404 -0.2130647 -0.784283 0.0433749 0.0077773 -0.0799938 -0.6555673 -0.0245862 -0.0983833 0.0275741 -0.5213096 0.1650525 -0.0499909 -0.0254165 -0.0402968 0.2191297 0.0039144 -0.0856448 -0.0093963 -0.0234094 0.1181789 -0.018512 -0.0626314 -0.0011719 0.1865239 0.0618812 -0.0738535 0.0680084 0.0530808 1.0487135 -0.030434 -0.028658 -0.1519447 0.2472397 0.0031146 -0.0504593 -0.0330193 0.5438616 0.1751262 0.2213002 -0.1234186 0.2905193 0.4791669 -0.0212694 -0.1238647 0.007484 0.3601218 0.2731585 -0.2605597 -0.0659329 -0.3113636 0.4122825 0.0807806 -0.0455376 0.0415854 0.3965944 0.0023 -0.0941258 -0.0478738 -0.0715533 0.0293768 -0.0544178 -0.0659655 -0.0473388 -0.0368829 0.0805453 -0.0039454 0.0016758 0.0315084 -0.1101073 0.0665497 0.0296055 0.0702556 0.002673 0.0108163 0.0196705 -0.0215557 -0.0958665 -0.1023162 -0.1139323 -0.0383655 -0.1000159 0.0458146 -0.1155079 0.0753669 -0.0512287 0.1099287 0.0084805 0.0081983 -0.0719224 -0.001543 0.0887627 0.0876133 0.0347743 0.0206988 0.0519259 0.0143604 -0.0915979 0.0708896 -0.0641866 -0.0866468 0.0854468 0.0943236 -0.0217159 0.0491562 -0.0978035 0.0940446 -0.0012542 0.0255844 0.0089219 -0.0929175 0.0027658 0.0278003 0.0726669 0.0490637 0.079124 -0.0534708 0.0253931 -0.2782888 -0.0306501 -0.0848575 0.0270424 0.0159571 -0.2426813 -0.0618634 0.024336 0.0145282 0.033718 -0.0515673 -0.1203068 0.1120348 -0.0572685 -0.0289356 -0.0408884 0.1432251 0.0851455 -0.2388758 0.0344347 0.1161346 -0.0401812 0.0933748 -0.0106543 -0.0000694 -0.0200801 -0.0046666 0.0582593 0.0275237 0.0524797 0.0039385 0.0835895 -0.0669624 -0.0185719 0.132222 -0.1074123 -0.2768274 -0.1461972 -0.0579844 -0.03444 -0.0749316 0.0376029 -0.0027234 -0.0653247 -0.0040297 0.0512094 0.0480149 -0.0899548 -0.00799 -0.1221936 -0.1829496 0.0206944 0.005157 0.0499107 0.0792997 0.0393837 0.017839 0.1140611 0.0003569 0.1020733 0.0232324 0.0660251 -0.0212081 -0.1103198 -0.0987454 0.1186434 -0.0357998 0.1648927 0.0102891 0.0249526 -0.0157106 -0.0073659 0.0669764 0.0942984 -0.0173569 0.0268456 -0.0147056 0.0840956 -0.0658517 0.0040734 -0.0006573 -0.1442301 -0.1186789 -0.1385504 -0.0474298 -0.0993512 0.059842 -0.0083936 -0.0751108 -0.0222342 0.0499735 -0.0664356 0.1724307 0.0275137 0.1334873 -0.0757378 -0.0071592 0.0406969 -0.0257994 0.090588 unknown
polarizability: 102.489856|-0.0499877|88.4194436|1.2573706|1.2835119|81.164989 unknown
InChI: InChI=1S/C7H16N2/c1-3-8(4-2)7-9-5-6-9/h3-7H2,1-2H3
charge 0 multiplicity 1
25 atoms
N  -1.608767 0.560243 -0.251376
N  0.745988 -0.01969 -0.21676
C  -3.00298 -0.011277 -0.346003
C  -2.240674 -0.042476 0.972783
C  -0.540046 -0.260109 -0.888607
C  1.258787 1.358703 -0.45512
C  1.747511 -1.088193 -0.468156
C  2.188582 1.850794 0.66942
C  1.468332 -2.383554 0.320662
H  -3.13756 -0.970444 -0.867382
H  -3.805133 0.715379 -0.507038
H  -2.487443 0.665998 1.769312
H  -1.856954 -1.011766 1.319008
H  -0.528203 0.034362 -1.968291
H  -0.756213 -1.352891 -0.838954
H  1.783299 1.42946 -1.442077
H  0.374634 2.018077 -0.505561
H  1.839225 -1.322164 -1.559962
H  2.731154 -0.695682 -0.153904
H  2.515414 2.888688 0.470543
H  1.655006 1.826202 1.635302
H  3.097144 1.22792 0.764528
H  1.4234 -2.164546 1.401676
H  0.511364 -2.851977 0.026616
H  2.269933 -3.124257 0.141141
