program: Gaussian 09
title: 000164846
version: EM64L-G09RevD.01
frameworkgroup: C1[X(C8H7N5)]
method: RPBEPBE
basis: SDD
operation: Freq
keyword: #p
keyword: freq=noraman
keyword: PBEPBE/SDD
title: #p freq=noraman PBEPBE/SDD
converged: YES YES NO NO
title: Mulliken charges:
elementType: N N N N N C C C C C C C C H H H H H H H
charge: -0.218008 -0.071103 -0.063815 0.020606 -0.021984 0.308838 0.020223 0.081281 -0.349694 -0.642803 -0.314555 -0.219039 -0.226509 0.237363 0.271932 0.241630 0.241503 0.251249 0.225111 0.227772
chargesum: 0.00000
title: Mulliken charges with hydrogens summed into heavy atoms:
elementType: N N N N N C C C C C C C C
charge: -0.218008 -0.071103 -0.063815 0.020606 -0.021984 0.308838 0.020223 0.081281 -0.112330 0.112262 -0.063306 0.006072 0.001263
polarizability: 2.18785500e+02 1.27261902e+01 1.25477648e+02 -2.18472428e-02 -2.69035727e-02 5.09089295e+01
1716.lowfreq: -6.6517 -0.5024 -0.0002 0.0008 0.0010 12.4146 68.0038 98.2955 110.9021
frequency: 68.0017 98.2955 110.8883 137.7571 160.8981 238.6320 277.1039 289.9722 340.8228 425.4089 438.1221 442.9225 516.0543 565.0223 579.2566 612.7095 663.8908 669.9285 744.6867 753.4624 766.7234 855.3586 856.5681 878.2063 935.5548 977.0770 1005.5451 1081.4704 1113.3673 1126.3747 1132.6937 1163.4682 1228.1026 1270.6911 1274.5660 1323.6775 1384.0620 1402.2985 1433.3324 1452.8981 1468.8661 1477.1276 1483.3880 1497.9819 1593.1030 1627.9465 2087.9051 2988.6552 3071.2227 3121.8058 3132.5863 3145.3779 3160.4072 3173.9741
redmass: 7.9972 9.1071 1.0954 2.6859 7.3245 2.9062 5.6270 7.5568 5.7294 10.2715 3.2938 11.9027 6.9128 6.0575 3.7543 5.7127 8.8197 8.1027 5.9396 1.3456 3.6228 6.6171 1.4791 5.5869 1.3761 1.3037 2.0345 3.0158 2.0678 1.3062 1.8571 1.1873 2.9039 8.6553 1.9491 2.8996 3.0957 3.9278 2.3475 2.1001 2.4352 1.0417 2.3877 1.7049 7.0665 7.8053 13.9959 1.0351 1.1025 1.0990 1.0854 1.0904 1.0960 1.0991
irintensity: 1.4600 0.0014 0.0595 3.7448 0.3899 2.4066 0.0004 2.1662 0.0786 2.1411 11.4885 0.5303 1.3974 4.9970 0.0081 8.9291 0.3259 7.7633 0.4677 108.0234 4.4837 11.6805 0.2014 0.1419 3.2797 0.0705 12.5058 2.7159 21.4525 0.2897 8.0754 3.1950 18.9114 17.8769 23.6231 18.1894 69.3805 22.4120 52.4464 94.0807 19.5152 17.3771 38.2472 84.0773 1.1687 8.0676 697.9694 46.8896 22.3601 2.5671 0.2893 12.4371 23.5276 18.6114
temp: 298.150 k
press: 1.00000 atm
elementType: 7 7 7 7 7 6 6 6 6 6 6 6 6 1 1 1 1 1 1 1
symmnumber: 1
zpe: 381765.6 jmol-1
zpe.correction: 0.145407 hartree
zpe.thermalcorrener: 0.156142 hartree
zpe.thermalcorrenthalpy: 0.157087 hartree
zpe.thermalcorrgfe: 0.108546 hartree
zpe.sumelectzpe: -581.848888 hartree
zpe.sumelectthermal: -581.838152 hartree
zpe.sumelectthermalent: -581.837208 hartree
zpe.sumelectthermalfe: -581.885749 hartree
dipole: 1.7719 3.8200 0.0029
dipole: 4.2109
quadrupole: -74.9744 -67.8185 -77.2734
quadrupole: -5.2116 -0.0027 0.0083
quadrupole: -1.6190 5.5369 -3.9179 -5.2116 -0.0027 0.0083
hfenergy: -581.9942946 hartree
pointgroup: C01 [X(C8H7N5)]
dipole: -0.7327176 1.4856347 -0.0262099 debye
dipolederiv: -0.4660156 -0.0269777 -0.0051998 -0.059563 -0.7443585 0.0046508 -0.0058698 0.0026221 -0.1360484 -0.6057422 -0.1763585 -0.0042811 -0.2076407 -0.5937926 -0.0003011 -0.0045729 0.0001355 -0.242267 -1.391958 0.4031533 -0.0230188 0.8070977 -0.5560866 0.0160608 -0.0263746 0.0095531 -0.1619859 1.6406491 -0.7657033 0.0306837 -1.5373786 0.642698 -0.0289318 0.0352953 -0.0162405 0.1160331 -1.1806672 0.342594 -0.0210104 0.806951 -0.2529334 0.0147056 -0.0234309 0.0068183 -0.0592353 0.1522125 0.30537 -0.0011356 0.3647072 0.0060884 0.0067448 -0.0017819 0.0062657 0.0642005 0.3131628 0.1614576 0.0035706 -0.1929979 -0.0892008 -0.0022341 0.0068651 0.0034416 -0.0012608 1.3210258 -0.3129637 0.0216326 -0.066409 0.9015659 -0.0070887 0.020683 -0.010473 0.1730274 0.1546878 -0.1303164 0.0066976 -0.0312869 0.0272094 -0.0024941 0.0058742 -0.0039301 -0.1955631 0.0624958 0.0518123 -0.0034947 0.0563925 0.5586121 -0.0029531 -0.0035252 -0.0021865 0.2462341 0.1494431 -0.0409165 0.0051156 0.062622 0.1015613 -0.0011765 0.0042389 -0.0028993 -0.1522132 -0.0869618 -0.0161929 0.0014565 -0.2773909 0.0822955 -0.0065494 0.0036963 -0.0024834 -0.175749 -0.169528 0.0973136 -0.0006842 0.2874141 -0.0234858 0.0032667 -0.0021541 0.0002198 -0.1791952 0.0840313 0.0067007 -0.0015132 0.0546524 -0.097696 0.0032064 -0.00188 0.0023863 0.1763145 -0.0340667 -0.0717119 -0.0025254 -0.0122364 0.118023 0.000169 -0.0029616 -0.0008845 0.1300277 0.0772369 0.0833603 -0.0914106 -0.0060231 -0.0413932 0.0356488 -0.0557497 0.1068718 -0.0545413 0.071616 0.0898823 0.0943696 -0.0030584 -0.0438045 -0.036175 0.0606272 -0.1034594 -0.0453521 0.0894339 0.0428128 -0.0015807 0.0016769 -0.0606784 0.0019706 -0.0012576 0.0026413 0.1667558 -0.1188093 0.0639086 -0.0049856 0.0642991 0.0654851 0.0018366 -0.0050378 0.0018819 0.1650538 -0.0622463 -0.1072246 -0.002686 -0.111828 -0.0001091 -0.0003561 -0.0026839 -0.0002808 0.1657643 unknown
polarizability: 219.2979742|-10.4578287|124.914489|2.7588819|-0.806222|50.9596142 unknown
InChI: InChI=1S/C8H7N5/c1-13-7-5-3-2-4-6(7)10-8(13)11-12-9/h2-5H,1H3
charge 0 multiplicity 1
20 atoms
N  0.201907 1.20255 0.00594
N  0.624957 -1.067395 0.031191
N  2.509588 0.531424 0.048992
N  3.396275 -0.37483 0.070452
N  4.35181 -1.069083 0.090703
C  -1.052796 0.567419 -0.009452
C  -0.770089 -0.844433 0.006962
C  1.149826 0.171043 0.029432
C  -2.365898 1.077849 -0.034276
C  0.458898 2.644011 -0.006255
C  -1.833622 -1.774788 -0.001889
C  -3.413319 0.130626 -0.04282
C  -3.151068 -1.270928 -0.026872
H  -2.574674 2.152657 -0.046541
H  1.546903 2.807507 0.012752
H  0.042565 3.106107 -0.919275
H  0.008104 3.127238 0.879048
H  -1.627973 -2.849194 0.01056
H  -4.451479 0.47985 -0.062007
H  -3.994613 -1.969629 -0.034246
