program: Gaussian 09
title: 000164841
version: EM64L-G09RevD.01
frameworkgroup: C1[X(C9H10O)]
method: RPBEPBE
basis: SDD
operation: Freq
keyword: #pfreq=noraman
keyword: PBEPBE/SDD
title: #p freq=noraman PBEPBE/SDD
converged: NO YES NO NO
title: Mulliken charges:
elementType: O C C C C C C C C C H H H H H H H H H H
charge: -0.281914 0.303989 0.303991 -0.528075 -0.528075 -0.435080 -0.329889 -0.329890 -0.223323 -0.223322 0.229471 0.217048 0.217048 0.229471 0.213966 0.241670 0.241248 0.241248 0.220210 0.220209
chargesum: 0.00000
title: Mulliken charges with hydrogens summed into heavy atoms:
elementType: O C C C C C C C C C
charge: -0.281914 0.303989 0.303991 -0.081556 -0.081556 0.020555 -0.088641 -0.088642 -0.003114 -0.003113
polarizability: 1.10478815e+02 -1.24079517e-05 9.95689184e+01 3.75967980e+00 -1.10261578e-05 6.02750690e+01
1716.lowfreq: -19.2786 -8.9760 -0.0009 -0.0008 0.0002 3.4184 162.1911 185.3133 221.4144
frequency: 162.1907 185.3117 221.4143 304.2727 362.2190 437.9802 441.2831 499.7234 524.3945 580.0353 612.9203 649.3402 653.9868 732.3587 756.0874 786.4994 835.3658 855.5341 889.3079 908.5230 946.1088 974.3886 975.5238 1015.4724 1047.6844 1062.5235 1139.3269 1162.0728 1165.4761 1173.4527 1195.7747 1216.6695 1222.7624 1269.0098 1299.5599 1318.3725 1337.6093 1394.1006 1433.4685 1452.6776 1455.0983 1470.9756 1553.9039 1624.5352 2992.4681 2993.5547 3031.6688 3058.0231 3058.6679 3098.6915 3117.8225 3124.5528 3142.0520 3157.8327
redmass: 2.8230 2.3491 2.0331 3.2888 2.9949 3.0314 3.0679 4.4521 6.2715 6.0038 3.2466 2.4064 3.2230 3.1703 1.7739 1.6235 3.1789 2.4385 1.5121 2.4046 1.3453 2.5118 1.3229 2.4873 3.6553 1.9579 1.1984 1.2305 1.3099 1.5991 2.0014 1.2639 1.5091 3.0221 1.3068 1.3493 2.0723 1.9476 2.1425 1.1013 1.1100 1.1119 8.1711 5.7515 1.0612 1.0618 1.0630 1.1000 1.1008 1.1048 1.0840 1.0871 1.0970 1.1005
irintensity: 1.1136 0.0988 2.8752 0.7951 12.3791 0.8635 11.8368 2.9296 0.2828 1.7958 20.1625 9.6115 0.6427 11.3278 80.8026 0.0667 0.1488 32.6702 0.0023 11.2927 1.9145 3.0799 0.0464 2.9922 6.4608 13.7220 0.0407 2.9384 2.8057 0.4778 8.7618 1.8244 3.0592 19.6090 0.8466 3.9535 0.0176 5.6840 15.2181 11.1918 5.5061 11.8526 1.6518 1.2381 42.4018 15.0526 39.8673 28.1793 13.6039 34.3372 0.1405 2.7730 34.2007 30.3783
temp: 298.150 k
press: 1.00000 atm
elementType: 8 6 6 6 6 6 6 6 6 6 1 1 1 1 1 1 1 1 1 1
symmnumber: 1
zpe: 431137.9 jmol-1
zpe.correction: 0.164212 hartree
zpe.thermalcorrener: 0.172055 hartree
zpe.thermalcorrenthalpy: 0.172999 hartree
zpe.thermalcorrgfe: 0.132275 hartree
zpe.sumelectzpe: -423.385962 hartree
zpe.sumelectthermal: -423.378119 hartree
zpe.sumelectthermalent: -423.377175 hartree
zpe.sumelectthermalfe: -423.417899 hartree
dipole: 0.2303 0.0000 -2.5001
dipole: 2.5107
quadrupole: -52.6381 -52.9709 -65.1011
quadrupole: 0.0000 0.3324 0.0000
quadrupole: 4.2653 3.9324 -8.1977 0.0000 0.3324 0.0000
hfenergy: -423.5501741 hartree
pointgroup: C01 [X(C9H10O1)]
dipole: 0.0533998 -0.000045 -0.9863529 debye
dipolederiv: -0.6273376 -0.00001 -0.0025422 -0.0000217 -0.2234708 -0.0000191 -0.2147861 -0.0000251 -0.6304704 0.4258965 0.1926517 -0.0888018 0.2609744 -0.0009909 0.0301087 0.0394319 -0.0775607 0.3268401 0.4259206 -0.1926385 -0.0887828 -0.2609469 -0.0010118 -0.0300823 0.0394492 0.0775948 0.3268346 -0.0781677 0.0424008 0.0699411 0.01441 0.053593 0.0525751 0.0056945 0.0083051 0.1049265 -0.0781645 -0.0424015 0.0699471 -0.0144168 0.0535848 -0.0525667 0.005695 -0.0083001 0.1049327 0.0645241 -0.0000007 -0.0444482 0.0000021 0.028415 0.0000037 0.0223005 0.0000059 0.1418641 -0.0341041 -0.1322788 0.0832736 -0.0912113 0.0144686 -0.0410493 0.1485898 0.0027366 -0.2260719 -0.0341161 0.1322842 0.0832598 0.0912233 0.0144847 0.0410305 0.1485839 -0.0027535 -0.2260752 -0.026058 -0.1263996 0.0041819 -0.1692568 0.0946024 -0.0563045 0.0137891 0.0276611 -0.1458575 -0.0260733 0.1263941 0.0041652 0.1692518 0.0946212 0.0562815 0.0137732 -0.0276833 -0.1458601 0.0165369 -0.0644556 -0.0214316 -0.0772699 -0.0880095 -0.0659076 -0.046547 -0.1068961 0.0392139 0.034254 0.0199698 -0.0276898 0.0194615 0.0401293 0.0519637 -0.0065109 0.0983324 -0.1279138 0.0342562 -0.0199724 -0.0276844 -0.0194624 0.0401131 -0.0519814 -0.0065034 -0.0983487 -0.1278999 0.0165293 0.0644589 -0.0214409 0.077271 -0.0879865 0.0659185 -0.0465599 0.1069059 0.0391977 -0.1096024 0. 0.1097101 0.0000022 0.0729741 -0.000001 0.1559265 0.0000002 -0.0137542 0.0306718 -0.0000029 -0.0564884 -0.0000061 0.0413482 -0.0000066 -0.1334043 -0.0000089 -0.0756739 0.0793676 -0.0053815 -0.0028856 0.0214235 -0.1038015 0.0341398 -0.0407714 0.0244037 0.1570233 0.0793683 0.0053904 -0.0028843 -0.0214181 -0.1038083 -0.0341149 -0.0407678 -0.0243805 0.1570289 -0.0968557 0.0977935 -0.0197045 0.0825493 0.0303787 0.01118 -0.0286958 0.0148407 0.1608563 -0.096846 -0.0978021 -0.0196942 -0.082559 0.0303663 -0.0111683 -0.028687 -0.0148296 0.1608587 unknown
polarizability: 110.690966|0.000366|99.5689183|1.8545608|-0.0018136|60.0629178 unknown
InChI: InChI=1S/C9H10O/c1-2-5-9-7-3-6-8(9,4-1)10-9/h1-2,4-5H,3,6-7H2
charge 0 multiplicity 1
20 atoms
O  0.361938 0.000038 1.375785
C  0.214482 0.766943 0.054976
C  0.214523 -0.766996 0.055043
C  1.566821 1.251641 -0.45407
C  1.566888 -1.251669 -0.453956
C  2.495621 0.000016 -0.334967
C  -1.071993 1.458239 -0.138041
C  -1.071915 -1.458377 -0.137903
C  -2.242541 0.731178 -0.156889
C  -2.242502 -0.73138 -0.156819
H  1.954564 2.107968 0.126607
H  1.458997 1.573746 -1.508204
H  1.459084 -1.57388 -1.50806
H  1.954675 -2.107923 0.126802
H  3.290708 0.000003 -1.100333
H  2.976433 0.000073 0.656602
H  -1.077084 2.543813 -0.291477
H  -1.076951 -2.543966 -0.291234
H  -3.204256 1.246951 -0.262191
H  -3.20419 -1.247215 -0.26207
