program: Gaussian 09
title: 000164797
version: EM64L-G09RevD.01
frameworkgroup: C1[X(C13H10S)]
method: RPBEPBE
basis: SDD
operation: Freq
keyword: #pfreq=noraman
keyword: PBEPBE/SDD
title: #p freq=noraman PBEPBE/SDD
converged: NO YES NO NO
title: Mulliken charges:
elementType: S C C C C C C C C C C C C C H H H H H H H H H H
charge: 0.207739 0.365058 -0.258698 -0.243146 -0.371940 -0.371951 -0.263651 -0.224223 -0.214295 -0.214309 -0.235674 0.073807 0.030822 -0.746612 0.260775 0.249748 0.249742 0.261239 0.229369 0.229368 0.230687 0.252203 0.252347 0.251594
chargesum: 0.00000
title: Mulliken charges with hydrogens summed into heavy atoms:
elementType: S C C C C C C C C C C C C C
charge: 0.207739 0.365058 -0.258698 0.017629 -0.122192 -0.122209 -0.002412 -0.224223 0.015074 0.015059 -0.004986 0.073807 0.030822 0.009532
polarizability: 2.87522069e+02 5.44761258e+00 1.10701688e+02 -2.13945733e-01 -8.34308718e-02 1.06452947e+02
1716.lowfreq: -57.0676 -42.7060 -15.5279 -3.3659 -0.0018 0.0006 0.0022 1.4459 43.1603
frequency: -57.0584 -42.4926 43.0291 50.9949 102.5633 110.9582 223.0312 239.9538 272.0317 301.0851 334.8508 398.8427 430.9743 446.3657 469.9729 527.3407 550.4283 579.4282 620.7934 621.5734 654.1941 690.8164 703.0005 769.8891 820.3293 853.0413 883.8027 900.2305 920.8130 937.5879 976.7228 988.4005 996.5158 1024.6476 1027.0149 1028.9043 1054.8726 1075.6557 1172.1672 1174.4908 1185.3066 1212.9190 1268.8509 1307.1685 1328.4001 1368.9834 1399.7984 1427.8061 1457.2328 1459.9649 1467.4696 1521.6757 1560.8894 1582.2706 1613.2230 2260.4026 2973.5018 3058.3880 3066.0572 3127.0013 3134.8354 3147.3311 3155.8005 3168.7066 3173.6810 3193.7287
redmass: 4.4815 1.0182 5.4447 4.5366 4.8936 4.5896 4.8425 5.4728 5.4861 4.4765 5.6014 2.8322 6.9599 6.0907 6.4293 3.9246 5.8435 3.8248 8.4099 6.0629 6.3854 6.2825 1.7762 1.9250 1.2649 1.2421 4.7010 1.4050 1.9303 2.9880 1.3848 6.2266 1.3175 1.3836 2.0592 1.4165 1.5896 1.5976 1.0534 2.0397 1.1132 3.1208 2.1172 1.3700 3.5578 6.8031 1.2289 2.2156 1.0412 1.0411 2.4006 8.0296 6.3641 5.9789 6.4253 11.7720 1.0350 1.0983 1.0981 1.0846 1.0879 1.0928 1.0970 1.1018 1.0904 1.1002
irintensity: 0.1975 0.0094 1.8318 1.6174 0.8276 1.4295 5.3244 1.1494 2.7348 2.5399 0.6412 0.0005 0.5343 0.0269 1.4268 6.3126 13.8873 0.6876 7.6511 0.3695 13.9878 2.9004 54.2296 44.7379 57.9243 0.0089 11.4883 0.0469 8.0165 8.0989 0.0002 2.8538 0.0795 6.2634 9.4607 6.8509 5.3316 8.8555 0.0021 34.9760 2.6597 4.3294 0.8229 0.2806 0.2863 0.0726 0.4181 8.1321 14.1430 13.7541 30.2996 7.1333 5.3373 1.3800 2.8576 12.3797 48.2145 12.7867 11.6978 1.0515 2.1963 20.8880 32.7261 23.8136 7.8788 3.0817
temp: 298.150 k
press: 1.00000 atm
elementType: 16 6 6 6 6 6 6 6 6 6 6 6 6 6 1 1 1 1 1 1 1 1 1 1
symmnumber: 1
zpe: 476106.0 jmol-1
zpe.correction: 0.181339 hartree
zpe.thermalcorrener: 0.192771 hartree
zpe.thermalcorrenthalpy: 0.193715 hartree
zpe.thermalcorrgfe: 0.142642 hartree
zpe.sumelectzpe: -898.420726 hartree
zpe.sumelectthermal: -898.409295 hartree
zpe.sumelectthermalent: -898.408350 hartree
zpe.sumelectthermalfe: -898.459424 hartree
dipole: -0.3112 0.3439 -0.0065
dipole: 0.4638
quadrupole: -62.4916 -87.8335 -85.8745
quadrupole: 0.6644 0.0467 -0.0056
quadrupole: 16.2416 -9.1003 -7.1413 0.6644 0.0467 -0.0056
hfenergy: -898.6020656 hartree
pointgroup: C01 [X(C13H10S1)]
dipole: 0.1240304 0.1338096 0.0028051 debye
dipolederiv: -0.2777508 -0.0022739 -0.0021371 -0.1106864 -0.237035 0.000678 -0.000561 -0.0013168 0.101085 0.2992803 0.0284226 -0.0004523 0.1493553 -0.0895701 0.000323 0.0001654 0.0009247 0.0363946 0.357383 -0.066584 0.0004705 -0.0701196 0.3247184 -0.0027841 -0.0000256 -0.0000571 -0.1979331 -0.2890022 -0.1129643 0.0011157 -0.1436592 -0.1143307 0.0016997 -0.000273 -0.0014863 -0.1373639 -0.1792297 0.0182238 -0.0886699 -0.0118556 -0.1175247 -0.0195174 0.0473871 -0.0082113 0.0487756 -0.1793375 0.0180623 0.0890146 -0.0119521 -0.1174867 0.0201068 -0.047368 0.0084915 0.0488538 0.0016935 0.0883465 -0.0020301 -0.0054663 -0.1538357 -0.0001232 0.0000274 0.0008062 -0.1646806 0.5307625 0.0766183 0.0030486 0.321378 0.3323944 -0.0009818 0.0008079 0.00096 -0.0941846 -0.067255 0.0230469 0.0979067 0.009101 -0.1403819 0.0213083 0.0719893 0.0158209 0.0729523 -0.0673749 0.0228313 -0.0978404 0.0090909 -0.1405363 -0.020809 -0.0719838 -0.0151956 0.0729572 0.0748464 0.0578746 -0.0000785 0.0520566 -0.1476462 0.0001314 -0.0000446 0.0001225 -0.0449952 -0.3035811 0.0112791 -0.0029716 -0.0559921 -0.1632717 0.0021281 -0.000144 0.0002141 -0.0226683 0.1486412 -0.0818701 0.0048803 -0.1351961 -0.0852431 -0.0021906 -0.0242005 0.006302 -0.1682816 0.0231705 0.0120569 -0.0081259 0.0716831 0.0779585 0.0036998 0.0313973 -0.0089817 0.1021455 0.0542035 0.0765846 -0.0000493 0.113187 -0.0112206 0.0000371 0.0000041 -0.0000777 0.1779161 0.0779896 -0.0202201 0.0900634 -0.0097379 0.1325925 0.0188151 0.0946245 0.0154354 -0.0301454 0.0779593 -0.0204704 -0.0901315 -0.0100137 0.1325067 -0.0192539 -0.0946213 -0.0158055 -0.0299604 0.0334933 -0.072252 0.0002054 -0.1041411 -0.0038217 0.0000047 0.0002378 0.0004626 0.1885201 -0.0045234 -0.028081 -0.0849555 -0.0332689 0.1496517 -0.0186358 -0.1115241 -0.0201841 -0.0701552 -0.004503 -0.0278881 0.0851044 -0.0330052 0.1497443 0.0180874 0.1115946 0.0196418 -0.0703112 -0.1401472 -0.0592935 0.0001118 -0.0621653 0.1476719 -0.0000628 0.0000938 -0.000068 0.088479 -0.0816011 -0.0510551 -0.0257837 -0.0998898 -0.0080412 -0.040816 -0.0459536 -0.0346761 0.1214258 -0.0242855 0.0476307 -0.0071026 0.0889068 -0.0012418 0.1069162 -0.0588328 0.1202177 0.0256907 -0.0608316 0.0619749 0.0384072 0.0823904 0.083949 -0.0687609 0.097203 -0.0833388 -0.0545161 unknown
polarizability: 287.3664159|-7.5600683|110.8569143|-0.2561903|0.0957208|106.4533737 unknown
InChI: InChI=1S/C13H10S/c1-2-6-12-9-10-13(14-12)11-7-4-3-5-8-11/h3-5,7-10H,1H3
charge 0 multiplicity 1
24 atoms
S  0.890037 -0.92906 -0.00026
C  -1.801924 0.060594 0.000161
C  -0.354093 0.391798 -0.000302
C  0.262282 1.63727 -0.000839
C  -2.506907 -0.096864 -1.223123
C  -2.506768 -0.093801 1.223913
C  1.698142 1.595035 -0.001204
C  2.235123 0.306685 -0.000912
C  -3.888245 -0.392339 -1.221843
C  -3.888103 -0.389287 1.223533
C  -4.582513 -0.539065 0.00107
C  3.586698 -0.104712 -0.000992
C  4.763554 -0.490452 -0.001216
C  6.160794 -0.940445 -0.000512
H  -0.315807 2.56422 -0.001013
H  -1.966242 0.016526 -2.168911
H  -1.965979 0.021918 2.169347
H  2.334942 2.482409 -0.001702
H  -4.420565 -0.508069 -2.172381
H  -4.420313 -0.502659 2.174418
H  -5.653671 -0.769136 0.001419
H  6.845043 -0.107973 0.245786
H  6.321897 -1.740273 0.745869
H  6.457218 -1.33832 -0.989011
