program: Gaussian 09
title: 000164835
version: EM64L-G09RevD.01
frameworkgroup: C1[X(C9H12N4O5)]
method: RPBEPBE
basis: SDD
operation: Freq
keyword: #p
keyword: freq=noraman
keyword: PBEPBE/SDD
title: #p freq=noraman PBEPBE/SDD
converged: YES YES NO NO
title: Mulliken charges:
elementType: O O O O O N N N N C C C C C C C C C H H H H H H H H H H H H
charge: -0.247660 -0.180337 -0.266115 -0.196243 -0.203580 -0.118460 -0.350606 0.049833 0.041418 -0.550090 0.381974 -0.355033 -0.249543 0.240486 0.344858 -0.350684 -0.422590 -0.683645 0.282165 0.258744 0.257951 0.217773 0.326816 0.208685 0.215922 0.331727 0.355986 0.211900 0.230449 0.217898
chargesum: 0.00000
title: Mulliken charges with hydrogens summed into heavy atoms:
elementType: O O O O O N N N N C C C C C C C C C
charge: -0.247660 -0.180337 -0.266115 -0.196243 -0.203580 -0.118460 0.005380 0.049833 0.041418 -0.009180 0.381974 0.120692 0.077273 0.240486 0.344858 0.073923 -0.090863 -0.023398
polarizability: 2.07990297e+02 -1.29799038e+01 1.71427950e+02 2.25252146e+01 9.48832495e+00 1.01767137e+02
1716.lowfreq: -20.8705 -10.8155 -0.0010 -0.0009 -0.0005 5.7552 11.6319 30.9127 33.5114
frequency: -14.9439 30.6126 33.2624 55.6325 65.9479 79.9310 105.4213 123.2341 143.2021 151.5454 200.1084 210.2893 233.7049 258.7035 292.0111 318.2379 329.5501 338.0866 421.7060 450.3531 481.7311 501.0123 567.8094 573.5375 590.2738 601.2944 669.4487 683.5363 700.3854 719.2935 732.4605 749.5140 761.6420 797.7340 841.3733 857.2890 871.7962 886.6431 933.6571 942.2711 960.5934 1011.0963 1065.1120 1085.5055 1091.6502 1113.4353 1136.5083 1158.1667 1200.3522 1207.4320 1234.9677 1246.9465 1262.4789 1279.2101 1328.3314 1337.7119 1341.3563 1352.6238 1359.7299 1373.4774 1394.4882 1400.6318 1445.1903 1453.8375 1463.4152 1469.0165 1481.9940 1482.5524 1490.0850 1517.1392 1518.8455 1638.3148 2974.5310 2985.8398 2989.9353 3040.3238 3070.0373 3070.4764 3078.3246 3082.0031 3144.1670 3254.6798 3262.4269 3466.8485
redmass: 3.5285 5.6102 5.6298 9.3721 11.8094 4.8378 2.2394 10.2328 8.8702 5.2381 3.7014 4.6462 1.5225 4.3801 4.8633 9.4792 8.1963 2.6987 2.4196 5.8085 2.4884 8.1615 4.2730 4.1148 4.4382 4.9085 5.9414 6.7955 5.6665 1.1322 13.5145 1.5195 4.8302 4.5807 1.9753 1.8131 1.8897 1.4842 1.7810 2.3705 6.5468 1.8416 2.0127 3.1714 2.8214 2.0497 1.9937 1.3973 2.4041 4.5174 3.7224 1.2137 1.9591 1.3105 2.2304 2.7348 1.6261 1.3087 6.7770 4.2260 3.7859 1.2247 3.3714 2.0419 1.0759 1.0826 1.0546 2.3696 1.1535 4.8578 1.6366 6.8437 1.0369 1.0668 1.0606 1.0998 1.0994 1.0606 1.0976 1.0989 1.1058 1.1001 1.1003 1.0789
irintensity: 0.2106 0.5693 2.9606 6.7031 0.7813 0.3007 0.1992 8.0729 9.7043 2.5931 0.3808 1.2299 2.3692 8.1382 1.1971 1.5250 0.5808 5.9449 5.6547 4.2824 6.9382 1.4001 3.5214 3.6580 2.7174 9.8939 17.8834 9.2407 21.6354 121.6575 10.0282 27.6922 42.3333 3.5412 3.1574 4.2760 11.9946 40.6313 4.3288 7.7731 9.3808 6.1279 3.6078 39.2661 26.1180 0.6895 4.4761 18.7335 119.2775 75.2634 342.3394 30.1425 106.2314 84.2567 26.5544 141.8186 28.7129 3.6021 38.7138 107.9580 2.8719 26.6935 61.2878 39.0028 7.3224 19.9062 11.2505 66.4304 3.0746 97.8166 155.6914 192.8215 22.6661 39.9944 28.1228 8.5162 83.1563 11.2631 14.8544 25.7282 0.1214 21.2307 19.9127 53.5115
temp: 298.150 k
press: 1.00000 atm
elementType: 8 8 8 8 8 7 7 7 7 6 6 6 6 6 6 6 6 6 1 1 1 1 1 1 1 1 1 1 1 1
symmnumber: 1
zpe: 583933.3 jmol-1
zpe.correction: 0.222408 hartree
zpe.thermalcorrener: 0.239066 hartree
zpe.thermalcorrenthalpy: 0.240010 hartree
zpe.thermalcorrgfe: 0.176222 hartree
zpe.sumelectzpe: -943.764108 hartree
zpe.sumelectthermal: -943.747451 hartree
zpe.sumelectthermalent: -943.746507 hartree
zpe.sumelectthermalfe: -943.810295 hartree
dipole: -4.5162 0.0010 -2.2715
dipole: 5.0553
quadrupole: -117.4910 -124.7494 -100.2744
quadrupole: 4.1368 -11.3896 5.3107
quadrupole: -3.3194 -10.5778 13.8972 4.1368 -11.3896 5.3107
hfenergy: -943.986517 hartree
pointgroup: C01 [X(C9H12N4O5)]
dipole: 1.656499 -0.0410298 1.100047 debye
polarizability: 201.5530171|13.0910958|171.1688654|34.5622223|-7.657038|108.4635014 unknown
InChI: InChI=1S/C9H12N4O5/c1-2-3-10-8(14)6-11-5-7(12(15)16)4-9(11)13(17)18/h4-5,10H,2-3,6H2,1H3
charge 0 multiplicity 1
30 atoms
O  1.515145 -2.894642 0.441303
O  0.334422 3.117664 0.456725
O  1.557425 1.570083 1.615256
O  -3.961309 0.543039 -1.780788
O  -3.90125 -1.618785 -1.018749
N  -0.4338 -0.421065 0.986115
N  2.808633 -0.972256 0.813199
N  0.52329 1.916946 0.887628
N  -3.430939 -0.415248 -1.095956
C  0.565814 -1.117985 1.830003
C  -0.447091 0.924716 0.537881
C  3.968659 -1.380362 -0.002329
C  -1.515456 -1.062156 0.428505
C  1.687763 -1.748952 0.957779
C  -2.220914 -0.122852 -0.356311
C  4.224504 -0.43049 -1.196402
C  -1.561782 1.130463 -0.292631
C  4.598648 1.009863 -0.780505
H  0.959319 -0.41311 2.57445
H  0.047608 -1.948585 2.333484
H  3.762984 -2.405001 -0.35575
H  4.866894 -1.413662 0.64595
H  -1.718948 -2.116497 0.59786
H  5.048226 -0.865894 -1.795205
H  3.329251 -0.420415 -1.847438
H  -1.84615 2.06018 -0.777292
H  2.787438 -0.027451 1.214791
H  5.499877 1.017308 -0.138611
H  4.815326 1.630296 -1.668197
H  3.782913 1.51145 -0.225963
