program: Gaussian 09
title: 000160578
version: EM64L-G09RevD.01
frameworkgroup: C1[X(C10H15FN5O13P3)]
method: RPBEPBE
basis: SDD
operation: Freq
keyword: #p
keyword: freq=noraman
keyword: PBEPBE/SDD
title: #p freq=noraman PBEPBE/SDD
converged: YES YES NO NO
title: Mulliken charges:
elementType: P P P F O O O O O O O O O O O O O N N N N N C C C C C C C C C C H H H H H H H H H H H H H H H
charge: 1.420761 1.539457 1.422085 -0.129889 -0.284842 -0.461220 -0.507950 -0.504046 -0.807684 -0.675577 -0.531868 -0.801552 -0.638428 -0.630235 -0.669512 -0.775849 -0.562076 -0.183873 -0.071066 -0.381769 -0.018531 -0.588638 -0.154963 -0.194284 0.003247 0.058253 -0.379882 0.330646 -0.186018 -0.121597 0.193371 0.147251 0.253750 0.308098 0.234237 0.253846 0.252821 0.273458 0.392960 0.423949 0.286492 0.365919 0.357200 0.441845 0.417840 0.396920 0.486943
chargesum: 0.00000
title: Mulliken charges with hydrogens summed into heavy atoms:
elementType: P P P F O O O O O O O O O O O O O N N N N N C C C C C C C C C C
charge: 1.420761 1.539457 1.422085 -0.129889 -0.284842 -0.068261 -0.084001 -0.504046 -0.807684 -0.233731 -0.531868 -0.801552 -0.220588 -0.630235 -0.272592 -0.775849 -0.562076 -0.183873 -0.071066 0.105173 -0.018531 0.134480 0.098787 0.113814 0.237484 0.312100 0.146397 0.330646 0.100474 -0.121597 0.193371 0.147251
polarizability: 3.44819476e+02 9.28509269e+00 2.63935190e+02 -1.48196015e+00 -1.10071371e+01 1.80869280e+02
1716.lowfreq: -10.7713 -5.5227 -0.0010 0.0013 0.0015 3.3754 10.8158 19.0076 27.3186
frequency: 5.9616 18.7629 27.2996 36.6192 46.6008 57.2303 64.9115 71.5439 82.3808 89.6012 94.1737 118.2621 122.7373 128.9534 135.6417 149.5029 158.5852 173.8751 180.0956 189.8846 196.5899 209.3039 223.2578 235.7749 241.2005 256.6096 264.8031 273.9108 282.1642 293.6091 299.7514 311.8776 320.2288 324.2039 331.7537 340.8049 348.4073 368.3227 375.8149 382.5492 392.9797 397.2586 418.7050 420.9856 434.7390 470.4951 492.8866 502.0831 527.6742 529.9776 555.1206 569.1422 574.5983 598.6381 607.9743 612.1330 636.0132 644.0683 644.7231 663.7758 671.6495 679.5474 685.2492 697.4712 720.4186 738.1901 754.9098 778.0121 782.6616 791.7366 818.2421 825.2752 834.7750 848.1374 880.7400 915.3219 930.3869 953.7350 957.4181 962.9323 979.7882 995.7332 1013.3914 1019.3502 1047.9325 1055.3523 1058.7654 1073.1460 1091.3718 1095.2190 1098.4087 1142.0198 1162.7723 1179.5868 1189.0722 1203.2342 1214.1859 1222.5736 1235.2449 1256.8253 1261.5611 1279.9723 1301.9021 1309.3591 1311.6766 1321.5407 1348.0384 1351.8355 1366.8241 1378.0291 1387.3736 1396.5259 1404.0928 1455.4075 1460.0810 1478.4735 1509.1571 1556.6641 1593.7049 1648.7440 1655.8799 2992.9224 2996.9904 2998.0394 3004.2619 3033.9211 3098.4951 3114.0861 3243.5835 3382.4306 3444.0797 3523.9058 3572.3634 3591.1903 3674.3892
redmass: 9.3346 9.5138 9.6410 8.6068 8.5872 7.9897 9.1433 10.0362 7.5898 10.6185 6.6873 8.5579 7.5381 8.2160 8.2224 3.5016 9.1552 7.6603 6.7773 5.4363 3.9141 4.1260 5.8892 4.6222 4.3052 8.0672 5.7595 4.1010 4.3209 3.8459 5.1250 5.1061 8.3099 6.8538 3.1346 4.6812 6.0450 9.2240 5.4250 10.4363 6.9069 4.9017 10.2865 7.3070 8.4540 5.2531 11.7554 10.2462 5.1263 3.9585 1.9042 5.7986 1.2169 4.3471 1.3483 1.6195 3.9760 3.8915 4.3165 4.6488 5.6481 9.4454 6.3066 4.7726 4.0608 3.5559 4.5607 4.7320 8.2653 2.0027 5.0141 2.8394 1.5810 7.0752 6.8460 4.5186 3.3418 5.3837 6.1057 2.2338 5.5504 3.6197 1.6329 2.8906 3.5660 4.3523 3.0632 2.0346 2.8002 4.2716 15.7583 2.5818 2.6424 1.5921 1.6509 1.3671 1.8405 1.2091 1.2007 1.2524 3.0925 1.2741 2.8811 1.2866 1.3180 1.2583 1.3370 2.1553 1.3445 1.5493 2.1840 1.7403 1.9121 4.6838 6.5208 1.0786 3.9062 4.0678 1.7987 1.4630 2.9276 1.0694 1.0856 1.0851 1.0859 1.0585 1.0864 1.1084 1.1000 1.0643 1.0668 1.0453 1.0661 1.0661 1.1058
irintensity: 1.0322 1.2392 0.4019 0.4339 0.9613 0.4730 3.3771 3.8173 3.4467 2.8901 9.1729 0.2309 15.8698 3.3478 4.7958 26.4162 2.3732 4.1000 3.0332 26.6668 27.2898 6.3046 14.7986 4.2282 18.0764 8.4518 22.6471 16.9724 6.8105 17.1284 10.3479 37.1117 65.1895 9.1448 15.8964 55.0388 65.3900 17.5676 83.9317 105.7657 44.6790 31.5671 92.5978 60.8514 28.8307 9.6391 25.9163 320.5451 32.8725 98.0702 61.8408 9.0905 23.1701 31.9479 121.9835 18.7826 40.9509 76.0401 61.3094 47.6890 120.9215 8.4192 260.7276 90.1038 40.5435 1157.0660 542.0659 1338.1660 15.5425 147.2098 108.3606 31.7226 10.0611 60.9597 502.2440 52.2332 25.7169 26.5139 183.6522 142.6727 35.3884 944.0437 88.2192 294.3441 101.0280 68.6246 45.2368 91.8420 7.3269 348.1824 212.7296 25.5709 79.5723 229.8171 252.7322 26.3093 60.5796 164.4749 7.7377 39.4311 381.9523 20.6462 2.0636 3.0350 190.5169 152.7931 35.1880 472.3569 238.9266 55.2927 10.1022 468.0782 226.5147 124.0424 61.4437 9.9463 401.0237 147.6605 44.3962 592.1178 297.6791 406.0611 67.8300 10.7145 47.9151 8.6784 2.5078 5.1232 2.7033 126.4191 217.7196 217.5087 106.1950 77.3036 70.7970
temp: 298.150 k
press: 1.00000 atm
elementType: 15 15 15 9 8 8 8 8 8 8 8 8 8 8 8 8 8 7 7 7 7 7 6 6 6 6 6 6 6 6 6 6 1 1 1 1 1 1 1 1 1 1 1 1 1 1 1
symmnumber: 1
zpe: 792740.2 jmol-1
zpe.correction: 0.301939 hartree
zpe.thermalcorrener: 0.334691 hartree
zpe.thermalcorrenthalpy: 0.335635 hartree
zpe.thermalcorrgfe: 0.235873 hartree
zpe.sumelectzpe: -2762.825916 hartree
zpe.sumelectthermal: -2762.793164 hartree
zpe.sumelectthermalent: -2762.792220 hartree
zpe.sumelectthermalfe: -2762.891981 hartree
dipole: 13.5604 -0.1043 3.4081
dipole: 13.9825
quadrupole: -192.5989 -219.9134 -208.3392
quadrupole: -2.8483 -16.4865 16.9480
quadrupole: 14.3516 -12.9629 -1.3887 -2.8483 -16.4865 16.9480
hfenergy: -2763.1278547 hartree
pointgroup: C01 [X(C10H15F1N5O13P3)]
dipole: -4.9935306 1.8332019 -1.4023737 debye
polarizability: 327.7522928|-34.0784098|281.9776929|3.2528218|5.3115447|179.8939597 unknown
InChI: InChI=1S/C10H15FN5O13P3/c11-10-14-7(12)4-8-15(2-13-4)9-6(18)5(17)3(26-9)1-25-30(19,20)27-31(21,22)28-32(23,24)29-33-16(8)10/h2-3,5-6,9,17-19,21,23H,1,12H2
charge 0 multiplicity 1
47 atoms
P  3.644497 -2.608594 1.230189
P  4.066504 -0.245162 -0.784505
P  1.718897 1.938701 -0.44873
F  -0.999261 3.548177 0.69361
O  -1.338208 -1.794123 1.004617
O  -1.405564 -2.825671 -2.339406
O  1.042853 -2.895527 -1.550967
O  2.071202 -3.079988 1.6591
O  3.309609 -1.744862 -0.348276
O  3.983579 -1.312513 2.267321
O  4.639238 -3.813622 1.066545
O  2.79419 0.746468 -1.293367
O  4.802522 -0.557108 -2.28136
O  5.037902 0.224024 0.386839
O  0.930652 2.536637 -1.863082
O  0.606319 0.94517 0.206502
O  2.570468 2.992746 0.36615
N  -3.095148 -0.705053 -0.156705
N  -5.210458 0.200319 -0.141881
N  -1.819918 1.438743 0.291117
N  -3.292204 3.362094 0.525612
N  -5.63423 3.186608 0.348726
C  -1.09866 -1.736954 -1.428928
C  0.290878 -1.945944 -0.746706
C  -2.1106 -1.791145 -0.241994
C  -0.051401 -2.472259 0.67044
C  0.935774 -2.121262 1.785012
C  -2.934049 0.655275 0.08477
C  -4.488013 -0.91752 -0.27878
C  -4.251227 1.195065 0.089635
C  -4.417154 2.591789 0.321524
C  -2.113841 2.754907 0.49486
H  -1.142179 -0.769311 -1.964306
H  0.806798 -0.979231 -0.66082
H  -2.686986 -2.730905 -0.355983
H  -0.203688 -3.57051 0.634762
H  0.496641 -2.319217 2.775494
H  1.269508 -1.070425 1.725096
H  -0.524736 -3.251667 -2.55784
H  2.012888 -2.714419 -1.408195
H  -4.889748 -1.909505 -0.472604
H  -6.472705 2.625234 0.200221
H  -5.701739 4.189094 0.520912
H  4.574659 -0.592337 1.83816
H  4.343302 -0.131504 -3.05222
H  1.354179 3.344469 -2.25136
H  -0.621444 1.14522 0.272802
