program: Gaussian 09
title: 000164878
version: EM64L-G09RevD.01
frameworkgroup: C1[X(C12H24O17P2)]
method: RPBEPBE
basis: SDD
operation: Freq
keyword: #p
keyword: freq=noraman
keyword: PBEPBE/SDD
title: #p freq=noraman PBEPBE/SDD
converged: NO YES NO NO
title: Mulliken charges:
elementType: P P O O O O O O O O O O O O O O O O O C C C C C C C C C C C C H H H H H H H H H H H H H H H H H H H H H H H H
charge: 1.396031 1.404567 -0.263802 -0.242567 -0.248312 -0.489713 -0.454743 -0.468648 -0.469038 -0.470346 -0.470148 -0.541097 -0.596452 -0.673780 -0.682455 -0.668946 -0.678630 -0.594025 -0.580644 -0.065809 -0.062927 -0.158585 -0.173001 -0.158610 -0.154855 -0.115893 -0.121421 0.009951 -0.005186 -0.334579 -0.318413 0.261646 0.248733 0.239891 0.235847 0.254012 0.260757 0.227521 0.230040 0.266382 0.284752 0.271322 0.253717 0.277101 0.256867 0.412305 0.372411 0.371759 0.373266 0.369574 0.370580 0.397061 0.405918 0.401195 0.409418
chargesum: 0.00000
title: Mulliken charges with hydrogens summed into heavy atoms:
elementType: P P O O O O O O O O O O O O O O O O O C C C C C C C C C C C C
charge: 1.396031 1.404567 -0.263802 -0.242567 -0.248312 -0.077407 -0.082332 -0.096888 -0.095772 -0.100772 -0.099568 -0.541097 -0.596452 -0.276718 -0.276537 -0.267752 -0.269212 -0.594025 -0.580644 0.195838 0.185807 0.081306 0.062846 0.095402 0.105901 0.111627 0.108619 0.276333 0.279566 0.190460 0.215554
polarizability: 2.78834459e+02 8.38349979e+00 2.35873653e+02 -4.97506858e-01 -2.46925430e+00 1.90830862e+02
1716.lowfreq: -11.1247 -3.3884 0.0011 0.0012 0.0014 6.5297 8.9203 13.5073 20.6328
frequency: 6.9066 13.4582 20.1757 24.1339 25.7520 33.7376 43.6587 50.5534 57.8032 78.3816 85.9008 96.3048 101.8129 109.4242 111.6006 130.2235 136.2714 150.0268 156.8724 167.2877 176.7763 205.6859 210.4517 216.7858 226.7679 229.5772 235.8840 241.3711 249.1548 252.5826 269.9213 278.3779 286.2009 290.9789 309.2858 328.1825 348.8138 350.7003 357.8909 360.6033 365.4152 372.6808 380.7086 381.0346 389.6303 393.1567 399.3196 413.0477 430.1197 432.2456 441.0420 445.0902 452.7265 454.1610 499.2664 511.5206 522.6600 531.4267 543.0040 555.1306 571.9432 621.5925 642.2754 644.6201 651.4415 687.9374 726.5925 730.5930 744.6463 751.4966 767.6239 800.4298 805.7756 872.7571 894.2154 913.3451 925.5464 938.6424 961.0450 963.8433 971.0462 998.0191 1002.1265 1003.0014 1003.3059 1016.0267 1016.5844 1018.6009 1023.9651 1032.4838 1036.8833 1050.7244 1052.8232 1059.4687 1063.4580 1070.6760 1073.1447 1087.9826 1090.9770 1099.1815 1113.3338 1147.0500 1149.7237 1182.8856 1185.4963 1210.0656 1213.4797 1217.2157 1223.3257 1228.2430 1230.7139 1282.8976 1290.1096 1294.3336 1297.2267 1302.1113 1308.2965 1310.1890 1313.0629 1315.2110 1316.5540 1327.8238 1330.7831 1334.0913 1364.8211 1367.0594 1369.5123 1389.7696 1392.5881 1400.6478 1408.1634 1409.8016 1415.7080 1461.5890 1462.1243 2972.6517 2974.0532 2974.3660 2977.1593 2995.6041 3001.8973 3014.6757 3023.3174 3025.9281 3030.1404 3035.3057 3047.5625 3108.6747 3116.6428 3413.9599 3542.6822 3544.9977 3560.1504 3561.3870 3566.1649 3592.0606 3594.1362 3613.8144 3614.1809
redmass: 8.8598 8.5712 6.8189 7.6570 8.0278 7.8552 6.8463 7.3653 7.4811 7.5191 6.6610 6.9998 7.2072 5.9510 6.6067 6.8924 5.1874 4.3166 1.8532 1.8194 4.3756 4.4195 3.6839 3.1713 3.9568 3.2912 3.5457 3.4151 2.9006 2.5716 3.9037 2.6050 2.6816 2.7041 3.3259 4.8988 5.7458 5.4314 3.5581 5.2449 3.7147 5.4450 1.9701 2.1813 6.4597 5.4280 3.2598 3.1695 1.2688 1.2572 1.3418 1.5735 2.9790 3.4279 5.5447 5.9767 3.2038 4.0202 3.2099 2.8349 1.7975 4.0475 4.8028 9.2589 9.1627 4.9886 10.4042 9.7360 7.2839 7.0870 5.7161 3.0775 2.9369 4.7018 6.0924 6.3256 6.2142 6.6886 5.4898 6.8712 5.3536 3.5642 2.3828 1.3480 1.5367 1.4359 1.3136 2.5812 3.2781 2.7822 2.8070 3.0513 3.0874 3.3628 3.8618 3.0661 3.1826 6.2756 6.7580 3.1587 2.2735 2.0418 2.0738 1.2387 1.2290 1.2052 1.2083 1.2155 1.1624 1.1613 1.1563 1.3105 1.1790 1.1779 1.2182 1.2134 1.2266 1.2616 1.2615 1.2266 1.3456 1.2243 1.2547 1.2706 1.3161 1.4170 1.4181 1.5772 1.4792 1.4294 1.6998 1.5513 1.6193 1.0856 1.0819 1.0824 1.0830 1.0831 1.0824 1.0856 1.0853 1.0845 1.0781 1.0877 1.0620 1.0565 1.0882 1.1097 1.1099 1.0689 1.0656 1.0655 1.0670 1.0656 1.0657 1.0663 1.0662 1.0666 1.0665
irintensity: 0.8336 1.0707 1.2588 1.7191 1.2088 0.5489 2.3224 1.1689 0.4251 0.4303 1.7558 0.3154 2.1925 1.0217 6.5439 9.9352 4.9298 21.8643 80.0371 84.0421 8.2104 6.8244 4.5055 4.5068 2.9690 1.1158 21.4993 18.9032 22.4155 37.7757 23.3204 128.5089 9.1880 43.8094 64.4604 48.2525 48.2860 43.7040 5.7986 33.8883 29.2823 102.5035 85.5361 165.2410 9.6194 3.5759 5.8282 10.4216 67.2327 61.2044 230.4165 153.0139 79.9312 51.3331 8.3708 24.6950 20.5485 5.1060 15.9653 86.5755 13.8373 10.6958 1.5398 61.5122 66.4464 3.1514 200.2735 241.4734 282.8173 148.6245 81.6378 19.0514 20.2200 161.0630 284.9628 123.5184 176.7551 173.2123 8.0154 109.4364 257.7796 58.1244 61.2596 26.6154 6.3247 120.0535 50.7198 105.8902 5.8746 22.2370 75.9635 146.8542 60.1955 12.4430 101.8755 36.5342 7.6324 173.1691 162.5067 153.4583 2.3586 17.4739 15.6717 4.2631 25.8542 1.6265 16.2840 13.5592 71.6242 23.0648 15.5924 36.0924 10.7836 5.5611 7.9041 7.8740 17.8118 23.4584 12.6696 14.1319 18.4287 15.7068 12.9941 3.2832 2.8222 9.7079 7.7531 2.2687 0.0937 1.7246 10.6071 1.4551 14.6035 22.0255 20.6766 11.6735 8.2084 8.4077 27.8658 64.1655 45.3660 13.0998 9.3320 27.1277 20.9031 9.3908 16.9949 4.8264 3.0912 328.1091 21.9250 23.6044 27.5843 22.4668 29.5169 76.7910 70.0035 86.7647 74.3847
temp: 298.150 k
press: 1.00000 atm
elementType: 15 15 8 8 8 8 8 8 8 8 8 8 8 8 8 8 8 8 8 6 6 6 6 6 6 6 6 6 6 6 6 1 1 1 1 1 1 1 1 1 1 1 1 1 1 1 1 1 1 1 1 1 1 1 1
symmnumber: 1
zpe: 1051481.8 jmol-1
zpe.correction: 0.400488 hartree
zpe.thermalcorrener: 0.436445 hartree
zpe.thermalcorrenthalpy: 0.437389 hartree
zpe.thermalcorrgfe: 0.328719 hartree
zpe.sumelectzpe: -2430.362997 hartree
zpe.sumelectthermal: -2430.327041 hartree
zpe.sumelectthermalent: -2430.326097 hartree
zpe.sumelectthermalfe: -2430.434766 hartree
dipole: -1.4144 0.2215 0.4293
dipole: 1.4946
quadrupole: -152.3404 -209.6111 -193.3170
quadrupole: -6.4897 2.6233 0.9387
quadrupole: 32.7491 -24.5216 -8.2275 -6.4897 2.6233 0.9387
hfenergy: -2430.7634856 hartree
pointgroup: C01 [X(C12H24O17P2)]
dipole: 0.5563339 0.0061007 0.1902919 debye
polarizability: 275.8024368|13.8272546|238.8798125|1.9268392|-2.0074324|190.8567254 unknown
InChI: InChI=1S/C12H24O17P2/c13-5-3(1-25-30(19,20)21)27-11(9(17)7(5)15)29-12-10(18)8(16)6(14)4(28-12)2-26-31(22,23)24/h3-20,22-23H,1-2H2
charge 0 multiplicity 1
55 atoms
P  -5.582946 -1.311961 -1.194125
P  5.050414 1.821718 -1.144924
O  -0.122728 -0.281199 0.145441
O  -1.723181 0.975552 -1.102321
O  1.721918 -1.260773 -1.001066
O  1.420573 2.072489 0.690953
O  -1.153902 -2.858645 0.876564
O  -0.634267 3.730164 1.86206
O  1.191739 -3.964805 2.1410
O  -3.253729 2.564316 1.90232
O  3.500558 -2.270036 2.111247
O  -4.182357 -0.593528 -0.558489
O  3.749601 0.873399 -0.57968
O  -6.934172 -0.828979 -0.217786
O  -5.880168 -0.286791 -2.53364
O  6.343874 1.662451 -0.005032
O  5.661635 0.786891 -2.360135
O  -5.421458 -2.871902 -1.394597
O  4.605745 3.298999 -1.484168
C  -0.326266 0.895848 -0.702004
C  0.320549 -1.438361 -0.610157
C  0.0964 2.162053 0.082488
C  0.166269 -2.704535 0.264122
C  -0.875637 2.42123 1.245189
C  1.156381 -2.675744 1.440958
C  -2.337986 2.429639 0.769045
C  2.596653 -2.406466 0.969933
C  -2.618436 1.077323 0.084496
C  2.585024 -1.072487 0.20112
C  -4.040445 0.890914 -0.401907
C  3.935692 -0.594728 -0.284537
H  0.241315 0.796588 -1.644536
H  -0.226854 -1.522592 -1.5679
H  0.046725 3.013191 -0.630277
H  0.400796 -3.573364 -0.387332
H  -0.741878 1.614244 1.996232
H  0.842905 -1.869679 2.136476
H  -2.478706 3.266212 0.051343
H  2.922704 -3.237161 0.308201
H  -2.378443 0.259706 0.790906
H  2.140502 -0.293944 0.851211
H  -4.755674 1.249936 0.357764
H  -4.216244 1.374972 -1.377315
H  4.692539 -0.70892 0.509918
H  4.250049 -1.095719 -1.214713
H  2.134453 1.844641 0.03069
H  -1.875321 -2.777558 0.201707
H  0.327753 3.774358 2.098229
H  0.266444 -4.182275 2.422312
H  -2.906532 3.301223 2.469686
H  3.307906 -3.024937 2.726493
H  -7.175681 -1.474878 0.494344
H  -6.779197 -0.36068 -2.940444
H  6.381909 2.377993 0.680164
H  6.562984 1.006594 -2.704626
