program: Gaussian 09
title: 000012933
version: EM64L-G09RevD.01
frameworkgroup: C1[X(C13H18ClN3O4S2)]
method: RPBEPBE
basis: SDD
operation: Freq
keyword: #p
keyword: freq=noraman
keyword: PBEPBE/SDD
title: #p freq=noraman PBEPBE/SDD
converged: YES YES NO NO
title: Mulliken charges:
elementType: Cl S S O O O O N N N C C C C C C C C C C C C C H H H H H H H H H H H H H H H H H H
charge: -0.001307 0.943109 0.276539 -0.506998 -0.523056 -0.355941 -0.425788 -0.450688 -0.436793 -0.069120 0.044176 -0.502858 -0.483429 -0.552028 -0.434009 -0.431011 -0.161751 0.613567 -0.312253 -0.382242 -0.159276 -0.285185 -0.090415 0.250372 0.256265 0.187495 0.188085 0.227040 0.231049 0.208879 0.208582 0.224058 0.223219 0.206350 0.333014 0.290350 0.315358 0.263084 0.322047 0.363308 0.388201
chargesum: 0.00000
title: Mulliken charges with hydrogens summed into heavy atoms:
elementType: Cl S S O O O O N N N C C C C C C C C C C C C C
charge: -0.001307 0.943109 0.276539 -0.506998 -0.523056 0.007367 -0.037586 -0.160338 -0.121435 -0.069120 0.294548 -0.059098 -0.068304 -0.112100 -0.001369 -0.001442 0.171263 0.613567 -0.312253 -0.119157 0.162771 -0.285185 -0.090415
polarizability: 3.73937924e+02 -1.19272636e+01 2.31366268e+02 -2.56219078e+00 1.96204009e+00 1.58833494e+02
1716.lowfreq: -31.0252 -11.3877 -4.1041 -0.0017 -0.0015 0.0007 2.0345 12.7155 14.2546
frequency: -30.8874 11.4064 13.3340 28.3177 40.4257 41.4746 54.6515 59.0267 82.7256 116.5640 130.0591 137.4939 152.3974 158.6549 174.8971 195.0411 202.2605 219.7190 234.8196 248.5446 272.7976 284.5418 308.5840 334.4820 345.3904 362.4935 375.7600 391.7344 409.4737 424.3365 432.1906 451.3039 463.5835 484.0083 489.0054 500.7697 518.0790 533.8734 574.3397 619.6993 631.1698 647.6073 658.0050 710.2055 723.0064 725.1804 760.6935 779.6904 809.9683 828.5479 832.9019 835.7576 855.6709 874.6055 886.9050 892.0322 894.5615 937.5342 958.4710 965.5207 979.0658 1008.6552 1016.6026 1031.8480 1058.9494 1085.2618 1106.8088 1114.6129 1120.1705 1164.1423 1180.4266 1194.6816 1202.5391 1220.8481 1234.0594 1238.8277 1256.6845 1267.7357 1272.0733 1282.2980 1290.2635 1296.5659 1302.2477 1311.0341 1323.1207 1324.6251 1346.4236 1355.6398 1374.1972 1405.7637 1440.4545 1453.6510 1463.4298 1473.1394 1473.7596 1474.9734 1492.3891 1530.9309 1602.4387 2954.9945 2965.4371 2969.6202 2993.0351 2998.6207 3000.0464 3014.6957 3024.0641 3039.8876 3052.5886 3057.8692 3080.5871 3152.4621 3165.3322 3364.4829 3383.5426 3515.2385 3552.3436
redmass: 1.6595 7.8685 6.3269 3.9900 6.0890 5.5215 9.3985 3.2246 7.1310 5.2777 6.0498 5.4198 5.1551 3.9707 5.5729 4.1614 5.7801 5.2676 6.5693 4.1604 6.1617 4.5287 3.9434 1.3922 4.9720 2.9477 5.1411 3.4409 2.6740 7.5031 2.0085 2.8084 2.8973 3.7007 7.2875 3.5752 2.8758 8.4385 3.4266 2.7572 9.5906 4.4190 7.3320 2.9174 4.6636 9.0075 1.3120 2.8446 1.5479 3.5331 3.8982 5.3831 1.7324 2.3775 4.7828 1.4627 2.5884 2.7365 2.2292 2.2264 1.4727 6.1947 2.2638 3.0558 2.6730 2.7992 2.4513 2.5355 2.5637 1.4883 1.4649 1.3208 1.1223 1.3100 1.2807 1.2635 1.4473 1.4219 1.8253 1.8210 1.3854 1.2046 1.3194 1.3848 1.4564 1.3448 1.4135 1.6106 1.2169 4.5249 2.3809 1.1019 1.0823 1.1006 3.7648 1.0895 1.0989 3.4787 8.0334 1.0591 1.0652 1.0659 1.0847 1.0624 1.0801 1.0661 1.0977 1.0974 1.0999 1.1023 1.1048 1.0921 1.0923 1.0750 1.0652 1.0673 1.0775
irintensity: 0.0623 1.4984 0.3568 0.1546 2.0176 2.8115 1.5605 0.5014 1.3904 1.4996 8.4751 2.1870 5.3127 0.4466 1.3787 3.4319 6.9191 0.1268 1.4494 4.3616 7.8966 25.0659 7.0108 125.2424 27.5220 21.0202 6.2633 64.4890 11.8017 25.8588 83.6755 21.9555 0.9713 3.4697 4.9288 18.9461 87.6597 74.3037 14.2428 0.4525 3.4593 19.6724 7.9562 4.6747 32.3993 47.6484 9.1626 28.8121 1.6037 95.4901 285.1571 125.9562 31.0227 3.9195 52.4958 12.6754 2.6650 22.6988 15.9553 21.1305 0.4395 79.8136 28.4539 42.3153 2.8229 9.4439 10.2733 3.4064 5.3674 6.3822 1.2713 14.3075 38.7350 5.1456 11.0810 20.0015 21.8918 15.2094 3.4475 5.3330 6.9198 5.1344 1.1586 1.3996 4.8684 60.3736 10.3330 16.1073 60.3603 3.0183 15.4478 7.0323 3.0485 16.8705 170.1712 13.8194 2.7063 76.7697 375.8028 18.7278 27.4338 41.8686 4.7242 31.6584 25.3266 53.0830 33.9962 42.9805 12.3793 5.7392 95.3037 1.6974 6.9353 14.0865 31.7266 34.0567 60.2476
temp: 298.150 k
press: 1.00000 atm
elementType: 17 16 16 8 8 8 8 7 7 7 6 6 6 6 6 6 6 6 6 6 6 6 6 1 1 1 1 1 1 1 1 1 1 1 1 1 1 1 1 1 1
symmnumber: 1
zpe: 796368.9 jmol-1
zpe.correction: 0.303321 hartree
zpe.thermalcorrener: 0.327600 hartree
zpe.thermalcorrenthalpy: 0.328544 hartree
zpe.thermalcorrgfe: 0.245538 hartree
zpe.sumelectzpe: -2225.464259 hartree
zpe.sumelectthermal: -2225.439980 hartree
zpe.sumelectthermalent: -2225.439036 hartree
zpe.sumelectthermalfe: -2225.522042 hartree
dipole: -4.5380 4.4583 -2.6157
dipole: 6.8783
quadrupole: -163.9419 -161.1836 -160.5402
quadrupole: -20.1711 8.2164 2.9782
quadrupole: -2.0534 0.7050 1.3484 -20.1711 8.2164 2.9782
hfenergy: -2225.7675797 hartree
pointgroup: C01 [X(C13H18Cl1N3O4S2)]
dipole: 1.8400039 1.7579456 0.920465 debye
polarizability: 374.6114759|6.8602111|230.1308964|-2.0735952|-6.6996206|159.3953136 unknown
InChI: InChI=1S/C13H18ClN3O4S2/c14-9-6-10-12(7-11(9)22-17(18)19)23(20,21)16-13(15-10)5-8-3-1-2-4-8/h6-8,13,15-16,18-19H,1-5H2
charge 0 multiplicity 1
41 atoms
Cl -3.973442 3.297411 -0.313576
S  0.220502 -1.621662 -0.197035
S  -5.036892 0.162379 -0.767441
O  0.862968 -1.955299 -1.645756
O  -0.425656 -2.782194 0.732405
O  -6.737473 -1.1981 0.918825
O  -4.527571 -1.954055 0.985402
N  1.604702 -0.789987 0.765339
N  0.848367 1.465672 0.130805
N  -5.381678 -0.704224 1.031716
C  4.462522 0.14702 0.558981
C  4.881157 -0.184954 -0.898472
C  5.754339 0.767395 1.151161
C  3.23611 1.072714 0.684849
C  6.350567 -0.688793 -0.779739
C  6.906146 -0.096851 0.563006
C  1.954694 0.47057 0.073472
C  -0.483832 1.161696 -0.103387
C  -0.97116 -0.168789 -0.297719
C  -1.466561 2.197832 -0.123345
C  -2.323567 -0.459993 -0.517253
C  -3.295308 0.572597 -0.523505
C  -2.820378 1.901236 -0.318961
H  4.237218 -0.803069 1.08274
H  4.221818 -0.930663 -1.376445
H  4.840736 0.741045 -1.50918
H  5.847789 1.817094 0.803973
H  5.756017 0.78394 2.256572
H  3.04672 1.317391 1.750279
H  3.449338 2.027471 0.158128
H  6.954366 -0.377465 -1.650529
H  6.375218 -1.793075 -0.751675
H  7.167857 -0.912058 1.262096
H  7.82284 0.499313 0.407516
H  2.146929 0.188778 -0.980783
H  1.261531 -0.655243 1.736302
H  1.099748 2.444173 0.278326
H  -1.156645 3.237878 0.019526
H  -2.654894 -1.493068 -0.659144
H  -6.716411 -2.034219 0.362476
H  -4.039032 -1.928942 1.853851
