program: Gaussian 09
title: 000174452
version: EM64L-G09RevD.01
frameworkgroup: C1[X(C7H15NO2)]
method: RPBEPBE
basis: SDD
operation: Freq
keyword: #p
keyword: freq=noraman
keyword: PBEPBE/SDD
title: #p freq=noraman PBEPBE/SDD
converged: YES YES NO NO
title: Mulliken charges:
elementType: O O N C C C C C C C H H H H H H H H H H H H H H H
charge: -0.480119 -0.447917 -0.093162 -0.349877 -0.379133 -0.445780 -0.449540 -0.390982 -0.110352 -0.303752 0.176896 0.231916 0.226080 0.185610 0.207985 0.231557 0.227930 0.217865 0.232545 0.170897 0.222964 0.234741 0.187647 0.344157 0.351825
chargesum: 0.00000
title: Mulliken charges with hydrogens summed into heavy atoms:
elementType: O O N C C C C C C C
charge: -0.135962 -0.096092 -0.093162 0.058934 0.032557 -0.006238 -0.003745 0.012460 0.112612 0.118636
polarizability: 1.02649841e+02 -3.33052177e+00 8.15526200e+01 -2.89679697e+00 1.27418660e-02 7.86082610e+01
1716.lowfreq: 0.0008 0.0008 0.0009 4.8904 9.6596 14.8464 25.9587 52.8827 71.0688
frequency: 25.4476 52.6368 71.0079 86.0956 143.5490 181.5273 243.8954 276.6479 306.8571 325.4446 335.7531 442.2099 497.8949 538.9742 602.5149 640.6902 780.2740 821.8912 832.6827 868.7863 892.4371 903.3951 955.5553 968.1855 985.1879 1032.8432 1053.5926 1058.8991 1075.1405 1099.2982 1135.6688 1147.6718 1153.4769 1185.6880 1199.6497 1210.2188 1228.0601 1242.6019 1248.2273 1290.2534 1295.9699 1304.9228 1318.9063 1323.9344 1349.6056 1359.8806 1380.5255 1398.6417 1455.7677 1460.6075 1465.1612 1478.5418 1480.3617 1497.1627 2791.7061 2838.2130 2853.7190 2957.7103 2977.6812 3013.3182 3021.9472 3025.6586 3029.0330 3042.1316 3070.7433 3093.5828 3111.2816 3530.9602 3578.1461
redmass: 2.0075 2.5357 3.5994 3.1136 3.6077 2.6384 1.9451 1.3732 3.1775 3.2337 2.5193 2.3100 1.1559 3.6032 2.1939 4.4119 1.3914 2.6471 2.1858 2.0520 1.7275 2.5562 1.7416 1.6637 3.2435 2.9731 1.6607 2.8864 2.3374 1.5601 2.5770 1.3134 1.7821 1.3213 1.3220 1.7053 1.3887 1.2236 1.2702 1.2946 1.2811 1.2399 1.2471 1.3702 1.4333 1.3515 1.4018 1.4927 1.0893 1.0855 1.0867 1.0866 1.0820 1.0991 1.0710 1.0714 1.0717 1.0718 1.0823 1.0602 1.0709 1.0830 1.0866 1.0865 1.1037 1.1055 1.0940 1.0650 1.0663
irintensity: 0.6266 0.1016 1.2538 2.1233 2.7775 0.9569 20.5078 102.3174 16.9795 4.1950 18.6875 24.5553 167.1300 20.3350 0.6177 2.0365 0.3956 22.9933 11.2326 9.1376 19.4340 6.5228 1.0532 6.1815 104.3064 79.2640 33.1590 11.8949 12.9078 0.9843 2.9881 28.1842 24.3329 1.8474 10.5811 18.9995 9.0431 2.7486 48.0487 6.5280 6.0019 12.0244 4.0073 8.3742 1.5220 25.5250 13.2616 6.3588 6.5383 5.1416 5.4838 12.4409 0.4366 2.4561 103.9735 87.0240 156.5313 24.8249 54.5428 20.5686 50.7956 37.2391 53.9022 36.6954 9.8057 68.6291 18.2254 10.6319 7.2626
temp: 298.150 k
press: 1.00000 atm
elementType: 8 8 7 6 6 6 6 6 6 6 1 1 1 1 1 1 1 1 1 1 1 1 1 1 1
symmnumber: 1
zpe: 572094.0 jmol-1
zpe.correction: 0.217899 hartree
zpe.thermalcorrener: 0.229302 hartree
zpe.thermalcorrenthalpy: 0.230246 hartree
zpe.thermalcorrgfe: 0.179238 hartree
zpe.sumelectzpe: -480.070461 hartree
zpe.sumelectthermal: -480.059058 hartree
zpe.sumelectthermalent: -480.058114 hartree
zpe.sumelectthermalfe: -480.109122 hartree
dipole: 2.8710 2.6035 1.6726
dipole: 4.2212
quadrupole: -66.3986 -64.9163 -58.9370
quadrupole: -6.8062 -3.6319 1.1225
quadrupole: -2.9813 -1.4990 4.4803 -6.8062 -3.6319 1.1225
hfenergy: -480.2883602 hartree
pointgroup: C01 [X(C7H15N1O2)]
dipole: -1.1307525 -0.8681407 0.8519716 debye
dipolederiv: -0.8208026 0.1270597 -0.2207844 0.1446275 -0.6340681 -0.004633 -0.2081779 -0.0134017 -0.2925341 -0.8009493 -0.2761649 0.0874587 -0.2805202 -0.3394306 -0.0512431 0.0904267 -0.0530984 -0.5702762 -0.7584584 0.0457343 -0.0157611 0.0305831 -0.5104667 0.0681229 -0.0321337 0.0361864 -0.4939354 0.3771909 0.2251385 0.0628692 0.2475764 0.2959425 -0.0346695 0.1192395 -0.0976963 0.2984448 0.0973897 0.0219926 -0.0848503 -0.025092 0.3254818 -0.0078478 -0.1120436 0.0290916 0.443529 0.0474725 0.0623906 -0.0341121 0.0785497 0.0261974 -0.0690932 0.0002578 -0.0374854 0.0970405 0.0281132 0.0034595 -0.0627788 0.0221831 0.1039144 -0.0494658 -0.0930962 -0.0472587 0.0346409 0.3437547 -0.1335485 -0.0263839 -0.2472042 0.2693579 -0.1881772 0.026462 -0.1651323 0.3051087 0.472798 -0.1628814 0.0871324 -0.1999937 0.4102176 -0.0217053 0.1481475 0.0112626 0.2413685 0.5504077 0.152123 0.0517335 0.2010393 0.2801591 0.1083685 -0.0486355 0.09614 0.3090544 -0.081366 -0.0651379 -0.0226477 -0.1467521 -0.1782558 0.0745537 0.0775562 0.1946831 -0.0561616 0.0480333 0.0323588 0.0523686 -0.0200277 0.003188 -0.099295 0.0146282 -0.1084964 -0.126888 -0.0293759 -0.1194195 -0.0525415 -0.120299 -0.0800732 -0.0468229 -0.016283 -0.038932 0.0219514 0.0113945 0.0303599 -0.0170653 0.0236159 -0.048969 0.1833582 0.0197315 0.0223714 -0.2405109 -0.1845713 -0.0703749 -0.036268 -0.1016098 0.0492696 -0.0156469 -0.0045353 -0.0011875 0.0686982 0.0813681 -0.018182 0.0319444 0.0269968 -0.0230995 0.1035237 -0.0167376 0.0834347 -0.1004115 0.0474857 0.0218007 -0.0050211 0.0697325 -0.1691906 -0.0007584 -0.0135856 0.0299521 0.0698875 -0.0437831 0.0010658 0.1011765 -0.0481139 0.0651864 0.0541243 0.1203222 0.0074816 -0.0881233 0.039465 0.0264558 0.0180634 0.0466556 -0.0114262 -0.075173 0.0155082 -0.120203 -0.0577868 -0.0893731 -0.0385926 0.0615214 0.0523299 -0.1138695 0.1291852 -0.0811402 0.2359012 -0.1745687 0.0123176 0.048523 -0.00356 0.0416239 -0.0737967 -0.08056 0.0483281 -0.1030843 -0.1130838 0.0074878 0.0661831 -0.0476184 0.1211888 -0.0071026 0.0268466 -0.047976 -0.0000559 0.0847391 0.0024479 -0.0411128 0.0097611 -0.0607518 -0.068306 -0.1632551 -0.0058197 -0.1110726 -0.0973081 0.3340626 -0.042571 0.1480971 0.0077702 0.2698272 0.1172852 0.1103464 0.1208564 0.0925074 0.3074904 0.1033403 -0.0827338 0.1358918 0.1593126 0.0429777 -0.11079 0.0297435 0.344618 unknown
polarizability: 102.6482918|-3.416487|81.6437648|2.707126|-0.4937232|78.5186651 unknown
InChI: InChI=1S/C7H15NO2/c9-6-7(10)5-8-3-1-2-4-8/h7,9-10H,1-6H2
charge 0 multiplicity 1
25 atoms
O  2.764426 -1.203254 0.573022
O  3.297878 1.263073 -0.620542
N  -0.828558 -0.2039 -0.136607
C  -2.03539 -0.909319 -0.639057
C  -1.282181 0.626153 1.015618
C  -3.111213 0.194031 -0.600938
C  -2.756711 1.01309 0.681759
C  0.328341 -1.073008 0.129758
C  1.62899 -0.273964 0.346046
C  2.050524 0.540866 -0.881063
H  -2.330468 -1.76423 0.023782
H  -1.855285 -1.310436 -1.652424
H  -0.631616 1.510563 1.138676
H  -1.240244 0.042313 1.970651
H  -4.134583 -0.218485 -0.572506
H  -3.019486 0.830011 -1.498227
H  -2.865592 2.096307 0.505133
H  -3.422655 0.746751 1.52132
H  0.478685 -1.743764 -0.737625
H  0.156853 -1.728734 1.029217
H  1.537162 0.408275 1.21739
H  1.28745 1.297993 -1.114342
H  2.15836 -0.14674 -1.747579
H  2.647284 -1.667901 1.438711
H  3.936528 0.592107 -0.262072
