program: Gaussian 09
title: 000174469
version: EM64L-G09RevD.01
frameworkgroup: C1[X(C15H16O5)]
method: RPBEPBE
basis: SDD
operation: Freq
keyword: #pfreq=noraman
keyword: PBEPBE/SDD
title: #p freq=noraman PBEPBE/SDD
converged: NO YES NO NO
title: Mulliken charges:
elementType: O O O O O C C C C C C C C C C C C C C C H H H H H H H H H H H H H H H H
charge: -0.264189 -0.263976 -0.201441 -0.169634 -0.179953 0.156628 -0.324583 0.214804 0.243224 -0.187868 0.580860 0.171053 -0.420116 -0.769129 -0.637856 -0.624558 -0.123445 0.145673 -0.517715 -0.761808 0.282567 0.274618 0.260079 0.233238 0.235378 0.233833 0.257330 0.259964 0.244327 0.252274 0.182659 0.238822 0.259336 0.243115 0.243804 0.232684
chargesum: 0.00000
title: Mulliken charges with hydrogens summed into heavy atoms:
elementType: O O O O O C C C C C C C C C C C C C C C
charge: -0.264189 -0.263976 -0.201441 -0.169634 -0.179953 0.156628 -0.042016 0.214804 0.243224 0.086750 0.580860 0.171053 0.073201 -0.042588 -0.377892 -0.127957 0.059214 0.145673 -0.019557 -0.042205
polarizability: 2.16063572e+02 1.01882792e+01 1.56960246e+02 -1.58862149e+01 4.46346352e-01 1.31619049e+02
1716.lowfreq: -6.8577 -0.0006 -0.0004 0.0004 2.7388 13.9586 31.6124 45.1056 58.9409
frequency: 31.4189 45.0816 58.9208 78.4970 90.0647 112.3591 121.7233 128.8371 176.9509 181.6636 195.8158 223.9836 246.5256 254.4494 268.0101 287.1849 293.7574 301.1833 327.3445 343.7779 390.5958 392.9299 408.9657 444.3707 470.6046 507.2329 550.0190 557.3491 575.0974 598.4992 621.6745 629.4732 677.2541 706.3319 747.1835 756.4922 784.3830 817.9415 823.6137 834.4828 861.6905 891.2820 898.1987 909.5007 948.6530 956.6731 969.2474 983.2719 987.5648 1005.7763 1053.1669 1055.2921 1084.8781 1101.6085 1108.7955 1126.3890 1129.2724 1142.1553 1150.9970 1176.8154 1208.1248 1224.7194 1242.1373 1264.9602 1272.3009 1283.5476 1313.9321 1321.2189 1334.3145 1342.0598 1352.8673 1380.1459 1394.8029 1404.2011 1432.3088 1451.1996 1462.5663 1466.1277 1468.2502 1477.3555 1480.7494 1490.3399 1570.9007 1626.2424 1631.2322 1635.6137 2920.6554 2958.9889 2976.5488 2991.9417 2992.3890 3005.3647 3058.0664 3075.9027 3085.4462 3090.3124 3092.0714 3097.9700 3103.1430 3108.0522 3131.1374 3190.5797
redmass: 6.4503 4.7167 7.3308 4.5724 5.2912 5.0402 3.6899 7.6099 1.1332 1.6193 3.4053 4.7811 2.8128 2.1523 4.3328 4.2884 3.0670 3.1079 3.3381 3.7115 3.4756 4.2943 5.3721 4.6548 4.2755 4.3327 4.1480 5.1366 4.6723 4.7777 5.2392 5.1698 3.5909 4.4912 2.7330 6.4872 3.2335 7.0981 3.2935 2.1956 2.7393 2.1023 1.7703 2.1591 1.7742 2.3598 2.0037 2.0521 1.4765 2.1888 1.3837 2.2161 2.1147 1.9022 1.6968 2.2554 1.3729 2.4890 1.7107 1.6911 3.0232 1.3711 1.9638 1.7019 1.9222 1.3587 1.8768 1.6637 3.6979 2.1020 1.8077 1.6988 1.2194 1.2149 2.9895 1.0891 1.0770 1.2240 1.0731 1.0513 1.0612 1.0537 10.9823 8.8594 9.4475 8.0562 1.0878 1.0810 1.0655 1.0515 1.0467 1.0362 1.0961 1.0532 1.0992 1.0995 1.1009 1.0977 1.0965 1.0942 1.0915 1.1194
irintensity: 1.0419 0.2232 8.9638 4.3786 1.9009 3.2344 10.8472 3.4078 0.2559 0.2689 3.6155 1.9450 5.9316 2.1280 0.8169 0.6543 3.3590 2.2333 8.1134 7.1626 3.2812 0.8123 0.6283 2.2680 20.7811 0.4156 8.0113 30.8635 1.9721 9.2171 11.3591 7.1222 9.3439 4.1952 2.5533 7.3334 13.6555 12.6554 5.7287 5.2785 37.9870 9.4638 4.0713 18.9099 1.6277 0.3836 17.4202 4.0050 8.2692 17.0561 4.2230 10.5615 7.3539 6.5989 23.7051 1.7428 20.4770 20.8675 1.1278 27.8229 0.0579 3.6004 24.0908 6.3124 18.9252 9.3780 1.1710 5.1915 38.0750 6.3648 10.8513 1.1360 13.4951 27.9321 5.6919 19.2342 13.7399 1.4127 13.9254 22.9011 2.9600 3.4536 180.4689 146.5202 169.2917 128.1534 96.9186 6.7424 10.0220 5.9449 20.9662 15.3320 22.2246 16.5805 13.4998 16.2878 15.6049 11.8827 18.7043 12.4403 5.8453 8.5462
temp: 298.150 k
press: 1.00000 atm
elementType: 8 8 8 8 8 6 6 6 6 6 6 6 6 6 6 6 6 6 6 6 1 1 1 1 1 1 1 1 1 1 1 1 1 1 1 1
symmnumber: 1
zpe: 729806.2 jmol-1
zpe.correction: 0.277968 hartree
zpe.thermalcorrener: 0.297014 hartree
zpe.thermalcorrenthalpy: 0.297958 hartree
zpe.thermalcorrgfe: 0.230888 hartree
zpe.sumelectzpe: -955.721876 hartree
zpe.sumelectthermal: -955.702831 hartree
zpe.sumelectthermalent: -955.701886 hartree
zpe.sumelectthermalfe: -955.768957 hartree
dipole: -0.2462 0.3438 -0.7644
dipole: 0.8736
quadrupole: -121.2321 -122.2241 -119.0349
quadrupole: -16.1563 -0.9764 -1.3562
quadrupole: -0.4017 -1.3937 1.7955 -16.1563 -0.9764 -1.3562
hfenergy: -955.9998445 hartree
pointgroup: C01 [X(C15H16O5)]
dipole: -0.0918711 -0.1797405 0.27816 debye
polarizability: 216.5822372|-12.1286577|156.1271629|12.886691|4.4702207|131.9334664 unknown
InChI: InChI=1S/C15H16O5/c1-8-10(17)4-3-9-5-11(18)15(14(6-16)7-19-14)12(20-15)13(8,9)2/h5-6,8,12H,3-4,7H2,1-2H3
charge 0 multiplicity 1
36 atoms
O  0.697139 0.593125 1.438276
O  3.094134 1.944354 0.394835
O  2.295139 -2.285343 0.351599
O  2.782122 -0.326554 -2.272312
O  -4.595836 0.972924 -0.101542
C  1.441675 -0.024789 0.26522
C  0.245436 0.83849 0.01631
C  -1.106344 0.263319 -0.402605
C  2.833214 0.491392 0.018796
C  -2.220004 0.938508 0.5157
C  -1.173704 -1.262318 -0.236617
C  1.281627 -1.532327 0.219425
C  3.742643 0.823549 1.161001
C  -1.303954 0.615986 -1.910617
C  -0.082476 -2.043006 0.042367
C  -2.533822 -1.899407 -0.45197
C  3.429093 0.194777 -1.334429
C  -3.589534 0.297915 0.240094
C  -3.644824 -1.218292 0.401355
C  -2.280102 2.474715 0.425322
H  0.451123 1.866822 -0.307805
H  -1.940441 0.651148 1.55301
H  3.34642 0.682792 2.172529
H  4.829617 0.745708 1.035966
H  -2.307253 0.328372 -2.269182
H  -1.194595 1.70254 -2.070989
H  -0.54701 0.101023 -2.527943
H  -0.187323 -3.13228 0.118621
H  -2.815401 -1.811229 -1.521001
H  -2.491334 -2.978155 -0.222439
H  4.484282 0.539276 -1.456062
H  -3.479428 -1.465166 1.468981
H  -4.644664 -1.581541 0.111047
H  -3.063251 2.852999 1.103819
H  -1.322309 2.934035 0.721611
H  -2.549852 2.815838 -0.588072
