program: Gaussian 09
title: 000174443
version: EM64L-G09RevD.01
frameworkgroup: C1[X(C16H14ClN3O)]
method: RPBEPBE
basis: SDD
operation: Freq
keyword: #p
keyword: freq=noraman
keyword: PBEPBE/SDD
title: #p freq=noraman PBEPBE/SDD
converged: YES YES NO NO
title: Mulliken charges:
elementType: Cl O N N N C C C C C C C C C C C C C C C C H H H H H H H H H H H H H H
charge: -0.057256 -0.270557 -0.446403 -0.119747 -0.044931 0.223271 0.172885 0.321042 -0.049311 0.357542 -0.337381 -0.399153 -0.793751 -0.524627 -0.131677 -0.388723 -0.228198 0.346937 -0.217524 -0.378320 -0.537487 0.247807 0.240967 0.339504 0.262322 0.240852 0.214249 0.285080 0.262709 0.259450 0.223545 0.241783 0.219955 0.220534 0.244616
chargesum: 0.00000
title: Mulliken charges with hydrogens summed into heavy atoms:
elementType: Cl O N N N C C C C C C C C C C C C C C C C
charge: -0.057256 -0.270557 -0.106899 -0.119747 -0.044931 0.223271 0.172885 0.321042 -0.049311 0.357542 -0.089575 -0.158186 -0.076329 -0.239547 -0.131677 -0.126014 0.031251 0.346937 0.006020 -0.136537 0.147618
polarizability: 3.61978077e+02 2.70579748e+00 2.17309731e+02 -4.65574801e+00 1.15683734e-01 9.70855261e+01
1716.lowfreq: -4.9247 -2.8872 -0.0008 -0.0004 0.0012 4.9537 14.0287 35.7484 45.7929
frequency: 13.9173 35.6971 45.7671 70.2219 92.7247 105.7745 114.6528 126.9990 153.7471 188.7899 201.3433 232.7084 253.1956 265.4100 272.3298 298.9298 315.1019 337.8619 359.6011 361.1884 431.4219 449.8352 457.4645 477.2171 515.9357 548.5320 561.8935 583.8988 631.5204 667.5595 669.6840 689.7567 696.7565 708.6093 726.8443 751.5053 797.4140 803.5737 818.2693 819.8884 875.7428 890.3357 921.7010 936.9366 956.6417 974.5670 978.0553 980.8646 1000.4062 1006.9401 1046.7734 1061.3552 1075.1984 1092.1499 1098.3264 1110.6706 1131.8749 1152.0222 1157.6788 1179.1814 1205.7185 1214.0194 1235.1966 1265.7783 1283.8753 1310.0285 1335.9987 1368.7476 1381.7283 1394.8251 1406.2156 1407.9250 1432.1441 1455.2271 1460.3131 1466.7818 1467.0929 1469.3414 1475.0619 1508.2769 1537.4719 1569.3650 1587.4545 1605.7642 1626.8648 2957.0222 2994.6100 3043.8471 3078.7857 3096.1868 3123.6068 3134.4129 3139.8676 3150.9871 3162.1127 3172.1618 3175.1470 3176.0780 3606.9395
redmass: 6.0947 5.1546 5.8225 3.8924 4.7729 4.6847 6.4832 5.0531 1.0346 5.4121 1.7031 5.2248 4.1616 1.7353 6.1739 4.5177 4.0632 5.0816 6.5163 7.4258 6.4592 3.0086 3.1607 4.0045 5.2403 4.6681 4.9683 5.4628 6.5776 5.3224 2.1813 2.0311 2.3810 4.1511 3.4555 5.0177 1.6771 6.1179 5.3762 1.3499 1.5191 1.4119 1.5408 8.3454 1.3418 6.3768 1.3353 5.9296 1.5707 5.7993 1.5636 3.0684 2.2902 1.7119 2.7544 1.2605 3.3073 1.3907 1.4298 1.1716 2.9981 3.2091 4.6490 1.8425 1.4837 2.7843 2.1501 6.5089 2.2341 8.0354 2.7855 1.3001 1.2801 1.0653 2.0937 1.0529 1.1267 2.3098 1.2271 4.9399 5.2556 7.8040 6.2819 6.6076 6.7538 1.0331 1.0365 1.1039 1.0961 1.1011 1.0991 1.0871 1.0895 1.0918 1.0917 1.0961 1.0960 1.0940 1.0826
irintensity: 0.2030 0.3790 0.4433 11.1093 0.2344 1.0721 1.8085 0.0073 0.6039 1.4489 0.2707 0.7945 0.8338 0.8126 1.4379 0.4760 0.2154 3.3063 2.8803 5.4606 1.0398 9.9215 1.1554 0.6966 10.5819 4.6148 4.5857 1.0342 20.2087 9.9050 41.3455 19.7713 28.1598 33.5651 8.7152 30.9963 32.9913 6.9333 58.9971 32.9832 17.6518 0.0244 26.3228 7.1284 0.0575 21.7660 1.3301 9.6492 17.1720 109.6827 9.4371 8.8469 7.3775 23.9018 11.9368 0.2316 15.2113 4.5472 3.1473 10.0085 15.1139 86.8214 29.9056 40.5370 8.7605 3.1834 4.5663 0.6395 20.6666 19.2493 68.0478 41.7434 23.2478 12.7998 97.6525 16.0644 29.6832 190.3254 5.6859 35.6272 6.9846 6.9009 67.9983 20.0316 47.3141 77.7577 16.8223 50.4025 8.5013 26.9909 25.4383 12.1621 13.2475 2.5786 11.8989 9.1775 3.5332 5.2865 59.3283
temp: 298.150 k
press: 1.00000 atm
elementType: 17 8 7 7 7 6 6 6 6 6 6 6 6 6 6 6 6 6 6 6 6 1 1 1 1 1 1 1 1 1 1 1 1 1 1
symmnumber: 1
zpe: 698403.5 jmol-1
zpe.correction: 0.266008 hartree
zpe.thermalcorrener: 0.284620 hartree
zpe.thermalcorrenthalpy: 0.285565 hartree
zpe.thermalcorrgfe: 0.217130 hartree
zpe.sumelectzpe: -1316.155920 hartree
zpe.sumelectthermal: -1316.137307 hartree
zpe.sumelectthermalent: -1316.136363 hartree
zpe.sumelectthermalfe: -1316.204798 hartree
dipole: 1.1762 0.9067 -0.8564
dipole: 1.7143
quadrupole: -104.6818 -119.2516 -133.7307
quadrupole: -1.4310 5.5646 -0.0895
quadrupole: 14.5396 -0.0302 -14.5094 -1.4310 5.5646 -0.0895
hfenergy: -1316.4219274 hartree
pointgroup: C01 [X(C16H14Cl1N3O1)]
dipole: -0.441358 -0.3614722 -0.3597945 debye
polarizability: 361.2541579|8.7512903|217.5835992|8.9519467|5.5428072|97.5355772 unknown
InChI: InChI=1S/C16H14ClN3O/c1-10-6-7-12(17)9-14(10)16-18-15(19-20-16)11-4-3-5-13(8-11)21-2/h3-9,20H,1-2H3
charge 0 multiplicity 1
35 atoms
Cl 6.389558 1.226657 0.933526
O  -4.651871 -1.973544 0.411358
N  1.091877 1.910473 -0.324378
N  0.065116 -0.043421 -0.044323
N  -0.257743 2.237029 -0.32811
C  2.616175 -0.083503 -0.088603
C  1.286513 0.543462 -0.153874
C  2.828819 -1.455874 -0.440615
C  -0.847696 1.009206 -0.148951
C  -2.305701 0.830232 -0.076405
C  3.713898 0.720699 0.333896
C  4.152892 -1.958738 -0.368794
C  1.709316 -2.375172 -0.885948
C  -2.836518 -0.462533 0.130188
C  5.004122 0.174334 0.38415
C  -3.179727 1.945763 -0.210771
C  5.248934 -1.165729 0.035184
C  -4.237075 -0.647515 0.202836
C  -4.569799 1.746691 -0.136336
C  -5.115924 0.45631 0.070169
C  -6.091091 -2.225467 0.504079
H  3.557589 1.753408 0.661677
H  4.332384 -3.004872 -0.640382
H  1.77717 2.6448 -0.489562
H  0.997743 -2.562743 -0.063464
H  1.108729 -1.926814 -1.69673
H  2.116137 -3.339409 -1.235079
H  -2.16915 -1.321928 0.23678
H  -2.758801 2.942628 -0.369942
H  6.259469 -1.580972 0.080932
H  -5.246999 2.601894 -0.239325
H  -6.201043 0.328624 0.124373
H  -6.611984 -1.945529 -0.432635
H  -6.542759 -1.680041 1.355861
H  -6.182459 -3.309205 0.668422
