program: Gaussian 09
title: 000174417
version: EM64L-G09RevD.01
frameworkgroup: C1[X(C7H10N2O3S)]
method: RPBEPBE
basis: SDD
operation: Freq
keyword: #p
keyword: freq=noraman
keyword: PBEPBE/SDD
title: #p freq=noraman PBEPBE/SDD
converged: YES YES NO NO
title: Mulliken charges:
elementType: S O O O N N C C C C C C C H H H H H H H H H H
charge: 0.944365 -0.565198 -0.512794 -0.512962 -0.710904 -0.713451 -0.168327 0.329428 0.445822 -0.564238 0.627568 -0.667827 -0.818747 0.293107 0.211154 0.278596 0.223513 0.233326 0.309358 0.334886 0.319435 0.308313 0.375576
chargesum: 0.00000
title: Mulliken charges with hydrogens summed into heavy atoms:
elementType: S O O O N N C C C C C C C
charge: 0.944365 -0.189621 -0.512794 -0.512962 -0.066660 -0.085704 -0.168327 0.329428 0.445822 -0.271130 0.627568 -0.456673 -0.083312
polarizability: 1.59771110e+02 3.69557140e+00 1.58054748e+02 -1.00681596e+00 -1.43102294e-01 7.42514818e+01
1716.lowfreq: -5.4785 0.0004 0.0019 0.0025 4.8217 7.9012 49.9380 77.7859 128.4128
frequency: 49.9376 77.7603 128.4068 141.2994 152.4931 172.3833 208.9373 219.7639 235.9319 258.5787 299.7815 319.6490 322.0065 334.6449 337.9653 355.1314 377.4059 385.6238 404.2065 424.1058 451.8320 518.3863 522.8715 572.0311 579.1380 621.4295 719.7790 742.8600 787.7907 833.5705 837.7944 870.5542 951.1176 973.6508 991.5521 1039.1556 1042.4835 1052.6909 1077.8853 1177.4679 1217.0158 1255.9023 1350.6864 1396.9681 1411.7156 1462.0685 1474.7726 1493.1218 1525.0395 1564.9191 1637.8522 1645.0506 1649.9555 2959.7923 3026.9253 3117.3973 3119.2430 3157.5683 3476.0010 3570.7520 3573.9342 3711.3895 3713.6036
redmass: 7.4753 3.2954 3.6300 1.2688 5.3390 1.6445 5.3424 3.9709 5.3451 2.9761 2.9767 3.8339 4.2894 5.9360 3.0672 1.0797 1.1754 1.2532 1.1764 9.3628 5.5632 3.3302 8.8540 5.1015 6.3424 3.0897 2.2937 4.6437 7.1273 1.4411 10.6774 2.3706 10.4194 1.9575 2.3009 1.4357 1.4431 1.1677 1.3999 2.4875 2.2992 1.6746 2.8420 5.2248 1.2482 1.5280 1.3041 1.5764 4.4061 5.4290 1.2173 1.2161 4.6643 1.0412 1.0982 1.0910 1.0935 1.0920 1.0660 1.0450 1.0451 1.1042 1.1037
irintensity: 0.4248 0.8887 3.4566 2.8437 0.4743 44.0864 7.0657 8.5950 4.4356 33.3865 14.7628 17.1573 13.1473 4.4763 10.3357 0.8391 228.7575 206.9221 138.7350 70.1634 2.8202 3.5621 108.9438 19.4220 53.0743 5.7313 5.5357 4.4702 13.1239 3.8822 57.9022 88.8240 97.3270 7.2363 6.4183 0.3524 3.7194 71.4929 4.9351 27.0593 21.4998 63.5558 22.7063 49.0788 17.9061 3.8075 13.3683 20.0215 93.1969 105.7668 80.9135 92.5914 458.0570 40.0894 19.1014 23.0198 1.9631 14.5056 35.0290 90.0283 55.6789 23.4238 26.4514
temp: 298.150 k
press: 1.00000 atm
elementType: 16 8 8 8 7 7 6 6 6 6 6 6 6 1 1 1 1 1 1 1 1 1 1
symmnumber: 1
zpe: 443107.1 jmol-1
zpe.correction: 0.168771 hartree
zpe.thermalcorrener: 0.183431 hartree
zpe.thermalcorrenthalpy: 0.184375 hartree
zpe.thermalcorrgfe: 0.128444 hartree
zpe.sumelectzpe: -1004.834682 hartree
zpe.sumelectthermal: -1004.820022 hartree
zpe.sumelectthermalent: -1004.819078 hartree
zpe.sumelectthermalfe: -1004.875009 hartree
dipole: -6.6617 1.2462 1.3614
dipole: 6.9127
quadrupole: -69.5936 -69.3128 -92.9848
quadrupole: 4.5824 7.1717 0.8897
quadrupole: 7.7034 7.9843 -15.6877 4.5824 7.1717 0.8897
hfenergy: -1005.0034531 hartree
pointgroup: C01 [X(C7H10N2O3S1)]
dipole: -2.6079458 -0.6572579 -0.4039414 debye
dipolederiv: 1.8558787 0.0781265 -0.0962709 0.0428618 1.3064364 0.0736611 -0.2253653 0.0322399 1.5483857 -0.5121344 0.0687582 0.2473822 0.0815445 -0.5690465 -0.10875 0.3119521 -0.0854952 -0.9453061 -0.6807933 -0.0924507 0.0063363 -0.0764654 -0.6611071 -0.0517336 0.0224683 0.0214304 -0.4635551 -0.7401243 0.014187 -0.0781399 0.0100236 -0.5536223 0.1163196 -0.0311412 0.0461011 -0.5696359 -0.5125098 -0.5617847 0.0019522 -0.5677639 -1.1527608 0.0223898 -0.0055015 0.0139803 -0.7096703 -0.6414532 0.7015489 -0.0017085 0.6910926 -1.1127711 -0.0214889 -0.0099596 -0.0155218 -0.7430944 0.0641008 -0.0072481 -0.0136984 0.0004943 0.5047532 0.0108816 -0.1195395 0.0007817 -0.0965828 -0.4454008 -0.5970587 0.0204344 0.1465923 -0.2214646 -0.0044986 0.0005726 0.0319555 -0.1019402 0.5487184 0.7160275 -0.0155535 0.4663584 1.1906617 -0.0121015 -0.0020098 -0.0104923 0.1672207 -0.5738284 0.5446692 0.0064271 -0.2784244 -0.4991527 0.0129016 0.0253322 -0.0172212 -0.2499571 0.7857184 -0.8586328 -0.0131869 -0.5886538 1.2245911 0.0152496 0.0077712 0.0205213 0.1918536 0.0546756 0.0636695 -0.0061651 0.0572476 -0.6459627 -0.002638 -0.0077713 -0.0027811 -0.3056088 -0.0217767 0.0261234 -0.0130797 0.0197086 -0.0205369 -0.0065598 0.0090314 -0.0324779 0.1316141 0.1439582 -0.0306039 -0.0063101 0.0019733 0.0353249 -0.0000847 -0.0086107 0.0010575 0.1888186 -0.1605991 -0.0067406 0.0085666 -0.0143463 0.0569216 0.0007092 0.0083108 -0.0000223 0.1771956 -0.0174081 0.0473869 -0.0016535 -0.0472823 0.1226122 -0.0075179 0.0003099 0.0195009 0.0926161 0.0695331 -0.0376344 0.0720403 0.0168547 -0.0611022 0.0828179 0.0320626 0.1260304 -0.0357694 0.0777862 -0.016696 -0.0567485 0.035666 -0.0522702 -0.0723106 -0.0236525 -0.1256059 -0.0486776 0.1500909 0.0618243 0.0046787 0.0444267 0.1809195 -0.0022333 0.0014818 -0.001682 0.3759302 0.177311 0.0312135 0.0030205 0.0518523 0.2191766 -0.0036871 0.0063464 -0.0014032 0.3527105 0.1325386 -0.0277407 0.0061574 -0.0551854 0.2293938 0.0028331 0.0084088 0.0014204 0.3856256 0.1637399 -0.0679439 0.0061299 -0.0383465 0.1623019 0.0021327 0.0017674 0.0019966 0.38691 0.0819783 -0.0490003 -0.0806107 -0.0002286 0.3167042 -0.0462923 -0.0022639 -0.0243131 0.2709171 unknown
polarizability: 160.1191343|-3.5587065|157.5903394|-3.3177847|0.0154348|74.3678666 unknown
InChI: InChI=1S/C7H10N2O3S/c1-4-6(9)2-5(8)3-7(4)13(10,11)12/h2-3,10H,8-9H2,1H3
charge 0 multiplicity 1
23 atoms
S  2.167395 0.499995 -0.016305
O  2.457102 -0.144589 -1.743144
O  2.492853 2.084998 0.011923
O  2.985635 -0.467763 0.99493
N  -2.310339 -2.357134 0.063048
N  -2.605985 2.515351 0.05954
C  0.297852 0.231407 0.001414
C  -0.233575 -1.069905 0.022366
C  -1.672897 -1.116993 0.051997
C  -0.416673 1.437477 0.009241
C  -1.836444 1.353509 0.045954
C  -2.445473 0.072896 0.065356
C  0.559907 -2.360882 -0.006435
H  0.108694 2.396927 -0.01024
H  -3.540237 -0.001845 0.08923
H  1.64468 -2.189679 0.037322
H  0.304411 -3.00152 0.861665
H  0.348715 -2.933477 -0.931467
H  -3.323788 -2.417013 0.082692
H  -1.77666 -3.219869 0.043477
H  -2.164182 3.42945 0.043257
H  -3.619886 2.470623 0.087286
H  3.447294 -0.124365 -1.893806
