program: Gaussian 09
title: 000174366
version: EM64L-G09RevD.01
frameworkgroup: C1[X(C7H13FO5)]
method: RPBEPBE
basis: SDD
operation: Freq
keyword: #p
keyword: freq=noraman
keyword: PBEPBE/SDD
title: #p freq=noraman PBEPBE/SDD
converged: YES YES NO NO
title: Mulliken charges:
elementType: F O O O O O C C C C C C C H H H H H H H H H H H H H
charge: -0.223613 -0.302062 -0.451528 -0.499665 -0.491707 -0.197336 -0.112231 -0.078762 -0.049188 -0.083235 -0.382325 -0.079096 -0.531512 0.238968 0.258461 0.251950 0.234787 0.241705 0.203469 0.379766 0.377230 0.225302 0.204980 0.266881 0.234243 0.364516
chargesum: 0.00000
title: Mulliken charges with hydrogens summed into heavy atoms:
elementType: F O O O O O C C C C C C C
charge: -0.223613 -0.302062 -0.071762 -0.122435 -0.127190 -0.197336 0.126737 0.179699 0.202762 0.151552 0.062848 0.146206 0.174593
polarizability: 1.09850386e+02 -5.16216340e+00 9.74705906e+01 -1.83584739e+00 3.34563010e-01 7.55951373e+01
1716.lowfreq: -16.5288 -5.7330 -1.3153 -0.0013 -0.0013 -0.0006 41.5038 63.7364 73.5608
frequency: 41.4545 63.7174 73.5357 85.4967 110.2050 118.1093 143.7924 160.3270 171.4155 176.4116 239.1179 240.6856 249.0867 269.7621 301.2279 332.8049 386.0187 421.9762 455.5673 489.5856 503.9662 533.2851 588.0217 646.3030 740.3698 767.3818 801.7748 871.1601 920.0152 953.5203 974.0983 1001.8313 1013.4541 1034.1084 1047.0364 1051.0145 1070.8054 1117.5309 1121.6350 1154.6529 1166.9569 1186.7351 1221.5946 1235.6009 1241.5245 1263.8930 1288.1959 1315.9607 1335.2467 1347.8753 1356.5939 1362.5866 1386.9054 1420.3952 1434.9250 1456.3760 1466.1322 1489.2239 1629.6102 2951.4887 2965.7511 2974.7437 2993.3418 3008.8635 3016.1803 3024.5004 3052.6636 3063.4111 3115.1852 3489.4803 3554.8458 3608.8802
redmass: 5.6923 7.2075 3.7848 6.0052 3.3357 3.6756 3.5909 3.4506 3.2276 1.4904 1.8153 4.6097 2.1923 6.0425 6.1765 3.8364 5.2913 3.3081 5.0243 2.4456 1.3013 1.0989 3.2902 4.5605 4.0188 4.4602 3.0703 2.6484 5.5117 2.6948 5.0138 4.0457 3.2538 3.6583 2.0190 1.8693 2.9139 2.2733 1.2406 1.3373 1.1549 1.2464 1.3239 1.6181 1.2259 1.1702 1.2417 1.4416 1.2140 1.2498 1.2385 1.2362 1.4024 1.9442 1.1444 1.0494 1.0825 1.0533 8.4208 1.0346 1.0623 1.0880 1.0826 1.0837 1.0850 1.0864 1.0998 1.1021 1.1024 1.0648 1.0670 1.0670
irintensity: 1.2957 3.4372 1.6163 2.5547 11.9494 7.4654 32.1253 0.8708 34.3310 6.0141 95.8502 13.4017 65.8600 5.6971 3.1689 7.7870 7.9743 2.5864 19.1584 112.4565 29.8761 218.9472 11.6586 22.3817 10.5746 22.6329 13.3864 34.3135 15.0962 24.4470 50.0867 106.3566 70.1860 19.2811 2.8070 22.5249 91.5460 10.4107 1.8360 6.9318 38.5964 10.7020 15.5905 4.7299 5.1357 2.5089 60.3604 5.7317 6.6276 16.4399 8.0479 15.0343 1.5230 8.2968 6.9400 5.5268 10.3193 10.0983 153.2121 82.9627 41.3020 30.5073 1.7860 2.8564 57.3067 17.5645 22.5669 39.6249 16.1194 47.8106 22.9862 10.6238
temp: 298.150 k
press: 1.00000 atm
elementType: 9 8 8 8 8 8 6 6 6 6 6 6 6 1 1 1 1 1 1 1 1 1 1 1 1 1
symmnumber: 1
zpe: 531548.3 jmol-1
zpe.correction: 0.202456 hartree
zpe.thermalcorrener: 0.217885 hartree
zpe.thermalcorrenthalpy: 0.218829 hartree
zpe.thermalcorrgfe: 0.159640 hartree
zpe.sumelectzpe: -749.372284 hartree
zpe.sumelectthermal: -749.356855 hartree
zpe.sumelectthermalent: -749.355911 hartree
zpe.sumelectthermalfe: -749.415100 hartree
dipole: -4.3121 1.4503 0.9794
dipole: 4.6537
quadrupole: -77.8692 -68.2801 -81.4965
quadrupole: 17.2905 2.0338 -1.9250
quadrupole: -1.9873 7.6018 -5.6146 17.2905 2.0338 -1.9250
hfenergy: -749.5747401 hartree
pointgroup: C01 [X(C7H13F1O5)]
dipole: -1.508457 -0.9393729 -0.440777 debye
dipolederiv: -0.3506818 -0.0635397 0.0163297 -0.0461412 -0.4801531 0.2455684 0.0532604 0.2144162 -0.5544533 -0.5022151 -0.0779152 0.0272031 -0.0297305 -1.0481582 0.1318838 0.0460958 0.2856856 -0.3864008 -0.7687816 0.0174113 -0.1705759 0.1286608 -0.6493572 -0.1675013 -0.1644554 -0.2189457 -0.3216527 -0.5096351 -0.0237111 -0.1458919 0.0393665 -0.7334741 -0.0910865 -0.1806484 -0.1032023 -0.5487248 -0.831433 -0.2200922 0.0522777 -0.2668346 -0.3203672 0.0093597 0.0870594 0.0002427 -0.5893215 -0.6166107 -0.2174535 -0.1132034 -0.4298982 -0.7665974 -0.188483 -0.1000867 -0.0806527 -0.4493624 0.2862886 0.0521106 0.0206633 0.0737803 0.4408919 0.1223921 0.145485 0.1905823 0.2838046 0.2904926 0.013499 0.0588254 -0.0251344 0.4733759 -0.0566796 -0.0552158 -0.3515717 0.2946997 0.285983 0.0260338 0.098404 0.1641743 0.3912746 0.1004801 0.0740922 0.1046525 0.3773132 0.3114224 -0.035275 -0.0366646 -0.042136 0.3151315 -0.3553536 -0.2057942 -0.3883947 0.3135902 0.5675776 0.2320972 -0.0397325 0.1561981 0.1843584 -0.0840461 -0.0609029 -0.0697764 0.3583631 0.6242609 0.3396511 0.1397128 0.40696 0.7746738 0.1286531 0.2254048 0.2427929 0.6862588 0.2275481 0.0553949 -0.0662248 0.0182411 0.747168 -0.0346256 -0.0614269 0.0809253 0.1934926 0.0376745 0.018696 -0.0398675 -0.0031401 -0.0342224 0.0408197 -0.0461524 0.024202 -0.1248725 0.0611441 -0.0058554 -0.0207681 0.0006089 -0.0387175 -0.0875434 -0.0053919 -0.0327946 -0.0802308 0.0651726 -0.0167114 -0.0333598 -0.0122393 -0.0044782 0.0526608 -0.0263777 0.0131735 -0.1192978 -0.0330378 0.0812565 0.0094597 0.0799435 0.0079176 0.0250437 0.0382913 -0.0161191 0.028731 0.0511733 -0.0249334 0.0154846 -0.0558366 -0.0356072 -0.0769038 -0.0006595 -0.1156767 -0.0378611 -0.0141885 -0.0282768 0.009085 -0.0458728 -0.0226213 0.093223 -0.0057421 0.1496098 -0.1294763 0.2945685 -0.1283163 0.0742776 -0.1340644 0.3031998 0.0267619 0.0846752 0.0509257 0.1773254 0.2289949 -0.0624691 0.0320256 -0.0834359 0.3811045 0.010152 0.0550738 0.0114456 0.3159014 0.0925328 -0.0335942 0.0240766 -0.0170434 0.0068362 0.1024454 0.0310082 0.0959163 -0.0752479 -0.0614119 0.0974217 0.1148577 0.0377287 -0.0733954 -0.0275076 0.1222335 -0.140381 -0.0114941 -0.0174856 -0.1021315 -0.0319881 -0.0653577 0.0396196 0.0004541 -0.0389338 -0.0813575 0.0719593 0.1065998 0.0046123 -0.0033475 -0.006241 -0.0133861 0.0784228 -0.0122472 0.1306702 -0.0740961 0.1740473 0.1020903 0.0089413 0.1574439 0.1549835 0.0014098 0.0013554 0.0036316 0.4010527 unknown
polarizability: 106.7715373|7.3269972|100.3912716|2.7718373|1.1490823|75.7533052 unknown
InChI: InChI=1S/C7H13FO5/c1-13-7(4(8)2-9)6(12)5(11)3-10/h2,4-7,10-12H,3H2,1H3
charge 0 multiplicity 1
26 atoms
F  2.186555 1.294109 -1.467216
O  0.956303 -1.356037 0.76117
O  -0.064952 1.619931 0.548488
O  -1.873575 -1.257313 -0.879681
O  -3.968623 -0.090127 0.290265
O  3.040068 2.122858 1.039686
C  -0.313416 0.506078 -0.38455
C  0.888432 -0.480675 -0.41386
C  -1.606496 -0.171212 0.080497
C  2.221914 0.297512 -0.393065
C  -2.797573 0.794477 0.102011
C  2.505184 0.993526 0.948772
C  0.619462 -2.764327 0.478567
H  -0.454373 0.888147 -1.416268
H  0.812968 -1.08011 -1.342403
H  -1.458024 -0.589979 1.095383
H  3.059101 -0.390844 -0.622131
H  -2.687912 1.514222 0.932638
H  -2.874974 1.337263 -0.863437
H  0.467624 2.320563 0.091242
H  -2.839482 -1.474892 -0.771874
H  2.251555 0.366954 1.831746
H  1.369535 -3.219378 -0.200447
H  -0.386784 -2.838021 0.027972
H  0.651262 -3.274786 1.453798
H  -4.801981 0.43876 0.3184
