program: Gaussian 09
title: 000179006
version: EM64L-G09RevD.01
frameworkgroup: C1[X(C9H10O4)]
method: RPBEPBE
basis: SDD
operation: Freq
keyword: #pfreq=noraman
keyword: PBEPBE/SDD
title: #p freq=noraman PBEPBE/SDD
converged: YES YES NO NO
title: Mulliken charges:
elementType: O O O O C C C C C C C C C H H H H H H H H H H
charge: -0.419083 -0.449025 -0.410014 -0.241945 -0.557533 0.201585 -0.482643 0.131488 0.182860 -0.379446 -0.432542 -0.173930 0.192631 0.218595 0.278721 0.282480 0.264782 0.251896 0.218893 0.228099 0.356300 0.360253 0.377576
chargesum: 0.00000
title: Mulliken charges with hydrogens summed into heavy atoms:
elementType: O O O O C C C C C C C C C
charge: -0.062783 -0.088772 -0.032437 -0.241945 -0.060217 0.201585 0.064620 0.131488 0.182860 -0.127550 -0.213649 0.054170 0.192631
polarizability: 1.41130195e+02 -2.32664520e+00 1.15274686e+02 -1.21572480e+01 1.64397915e+00 6.79225154e+01
1716.lowfreq: -17.0054 -9.3836 -6.9500 0.0006 0.0007 0.0009 5.9556 19.7780 57.0613
frequency: -12.9175 19.5261 56.9359 67.3266 149.9738 181.9499 228.6213 297.6550 325.7903 347.5063 358.0504 386.4967 422.3399 484.0784 494.9008 508.8221 534.8632 550.5812 586.4199 593.2851 654.3435 681.2843 719.6515 770.0426 776.9725 815.4095 847.8756 887.9800 922.8383 951.5025 1019.0914 1033.9956 1055.8968 1076.0710 1129.8147 1147.6809 1161.0720 1185.6701 1220.7336 1242.6289 1256.7948 1265.3297 1301.1504 1315.2140 1363.5647 1404.2804 1444.2794 1455.4134 1489.2404 1494.7846 1602.4960 1631.4929 1659.7433 2979.2240 2992.5710 3066.4197 3087.7448 3122.1160 3152.0075 3181.4061 3506.8704 3563.7162 3590.5996
redmass: 5.2256 9.8769 2.6822 5.0426 6.3624 8.0494 4.1142 4.1931 2.6281 2.0787 1.8063 1.0923 3.9249 3.6838 5.2237 2.5960 5.3798 3.0473 3.9767 4.5997 1.4186 4.6751 1.9476 1.6254 2.0198 5.2189 1.4344 4.2015 2.7738 1.3035 3.6329 2.4573 2.0558 2.2486 1.3431 1.3827 1.1162 1.6192 1.9667 1.3767 1.8617 1.4620 2.0872 1.4966 1.7917 5.5322 1.1016 2.7542 2.0076 1.3968 6.4803 7.1588 8.2129 1.0681 1.0674 1.0906 1.0958 1.0887 1.0924 1.0969 1.0638 1.0653 1.0660
irintensity: 0.1255 1.3027 0.4122 0.5452 0.6508 2.6622 0.5478 10.3676 0.8811 42.3496 75.4990 157.3766 14.6921 3.2787 19.6824 32.8519 2.1339 18.6313 24.2937 0.3495 115.7852 4.0686 37.1473 33.3283 30.6951 6.8168 2.4649 2.1228 59.2527 0.6988 160.9054 55.6866 53.2663 144.5267 180.0531 55.9915 3.5717 8.2962 49.3394 5.6550 34.1539 10.7788 19.0149 29.8949 61.2874 1.9264 21.1932 83.7726 39.6180 7.8359 92.7191 35.0759 225.4377 19.3349 7.9908 2.4935 5.7794 10.7592 15.0420 7.4130 19.7778 28.8831 33.2502
temp: 298.150 k
press: 1.00000 atm
elementType: 8 8 8 8 6 6 6 6 6 6 6 6 6 1 1 1 1 1 1 1 1 1 1
symmnumber: 1
zpe: 459498.4 jmol-1
zpe.correction: 0.175014 hartree
zpe.thermalcorrener: 0.186806 hartree
zpe.thermalcorrenthalpy: 0.187751 hartree
zpe.thermalcorrgfe: 0.135738 hartree
zpe.sumelectzpe: -648.891190 hartree
zpe.sumelectthermal: -648.879397 hartree
zpe.sumelectthermalent: -648.878453 hartree
zpe.sumelectthermalfe: -648.930466 hartree
dipole: -0.6045 2.5863 0.9556
dipole: 2.8227
quadrupole: -64.9518 -72.2696 -80.9334
quadrupole: -5.4730 2.4992 -1.4802
quadrupole: 7.7665 0.4487 -8.2152 -5.4730 2.4992 -1.4802
hfenergy: -649.0662036 hartree
pointgroup: C01 [X(C9H10O4)]
dipole: -0.2043484 -0.9885899 -0.4628453 debye
dipolederiv: -0.4810637 -0.5087342 -0.0028624 -0.4547912 -1.0080574 -0.1725908 0.0327516 -0.1497943 -0.3867388 -0.3475344 0.5045779 0.0067362 0.3973577 -1.1109833 0.1216875 0.036205 0.1217997 -0.3913288 -0.8628333 0.2519823 0.496794 0.2567629 -0.4763189 -0.1452147 0.4769771 -0.1437841 -0.7440233 -0.7571583 -0.127638 -0.1845951 0.0057886 -0.4560074 -0.2783992 0.0470569 -0.2438123 -0.8037145 0.0820625 0.0337207 -0.0253494 -0.0278818 0.0886083 0.0278652 -0.0175171 0.0474978 0.1157134 0.0677258 -0.0199016 0.0440665 -0.0177165 -0.478023 -0.0161865 0.0537482 -0.0029487 -0.1445481 -0.3934907 -0.0323276 -0.0631808 -0.0290314 0.1137335 -0.0617137 -0.2426917 -0.059466 -0.0451035 0.5008033 0.4541879 0.1240433 0.3639631 0.9469636 0.1386806 0.1129494 0.1483459 0.1145114 0.4020976 -0.3980565 0.0952247 -0.2336711 1.0690643 -0.072411 0.0785909 -0.0857537 0.0992551 -0.279661 -0.2783342 -0.0193805 -0.0574544 -0.1595247 -0.0140971 -0.0265798 -0.0900413 -0.2179156 -0.2981255 0.3030045 -0.0037807 0.0275045 -0.2255896 0.0102143 -0.0139726 0.0844563 -0.2418896 0.090123 -0.0012906 0.0725366 0.0216162 0.3131237 0.0125374 0.060772 0.0065286 -0.1037872 1.5070588 -0.0400596 -0.1569625 -0.1434275 0.4672755 0.5284055 -0.2134489 0.4970178 1.1766992 0.0628744 -0.0206968 -0.0166361 -0.0329351 -0.0707319 -0.1290212 0.0190893 -0.0746771 0.0220215 0.0632671 0.0190423 -0.0036884 0.0654721 0.0086543 0.0898862 0.0196075 0.0432219 0.0368277 0.0912882 -0.016798 0.0065984 -0.0002475 0.0016664 -0.0813271 0.0289298 -0.0532158 0.0572676 0.0746769 0.0251728 -0.0258021 -0.0048307 0.0043097 0.09714 -0.0132429 0.0551639 0.0362087 0.0625648 0.0548532 -0.0288939 0.0706243 -0.0312026 0.0138598 -0.0336779 0.0123022 0.1716901 0.049643 -0.0519672 -0.0357617 -0.0841171 -0.1056653 -0.0265099 -0.0420043 -0.0227342 0.1727246 -0.102519 0.0066139 -0.0715111 0.0017884 0.0912031 -0.0002459 -0.0737593 0.0029951 0.1356669 0.1787855 0.0787373 -0.0783306 0.0532175 0.3598802 0.0578041 -0.0932842 0.0210636 0.3017071 0.1342359 -0.1735817 -0.0513405 -0.0966307 0.3174452 -0.0296299 -0.0671231 -0.0457921 0.3557403 0.1551792 -0.0625069 -0.077924 -0.0813604 0.3401764 -0.0707336 -0.1293757 -0.0683733 0.2830158 unknown
polarizability: 141.1806743|2.2837087|114.7463859|11.5316098|6.2279193|68.4003362 unknown
InChI: InChI=1S/C9H10O4/c10-7-2-1-3-8(11)6(7)4-5-9(12)13/h1-3,10-12H,4-5H2
charge 0 multiplicity 1
23 atoms
O  -0.703752 2.444716 0.31583
O  -0.646786 -2.422921 0.241736
O  4.073656 -0.310181 -1.154304
O  3.619893 0.781513 0.842294
C  0.825957 -0.072207 0.702738
C  -0.640177 -0.025551 0.314455
C  1.752126 -0.066162 -0.542994
C  -1.334966 1.201369 0.132448
C  -1.367998 -1.219736 0.077334
C  -2.694092 1.243643 -0.257158
C  -2.727212 -1.208504 -0.310198
C  -3.381082 0.034036 -0.474649
C  3.201116 0.18683 -0.176902
H  1.112406 0.76807 1.367429
H  1.021196 -0.989694 1.282307
H  1.672955 -1.017889 -1.093851
H  1.44668 0.730606 -1.250965
H  -3.180129 2.215012 -0.379279
H  -3.265935 -2.148088 -0.48478
H  -4.43347 0.055854 -0.776428
H  0.212232 2.330612 0.674508
H  -1.23561 -3.202773 0.091292
H  5.011692 -0.094257 -0.896765
