program: Gaussian 09
title: 000012926
version: EM64L-G09RevD.01
frameworkgroup: C1[X(C16H30N4O2)]
method: RPBEPBE
basis: SDD
operation: Freq
keyword: #p
keyword: freq=noraman
keyword: PBEPBE/SDD
title: #p freq=noraman PBEPBE/SDD
converged: YES YES NO NO
title: Mulliken charges:
elementType: O O N N N N C C C C C C C C C C C C C C C C H H H H H H H H H H H H H H H H H H H H H H H H H H H H H H
charge: -0.278928 -0.278982 -0.097390 -0.097217 -0.369793 -0.371508 -0.410452 -0.423937 -0.424055 -0.410635 -0.394191 -0.393580 -0.531439 -0.532901 -0.368363 -0.369135 -0.364122 -0.363483 0.243803 0.245315 -0.402305 -0.402807 0.216433 0.238270 0.238076 0.222587 0.222327 0.238123 0.238506 0.216281 0.230798 0.218115 0.217449 0.229149 0.237168 0.223221 0.223773 0.240120 0.197285 0.186100 0.185400 0.199463 0.197984 0.226275 0.227144 0.197958 0.256384 0.207762 0.208099 0.255789 0.300112 0.299953
chargesum: 0.00000
title: Mulliken charges with hydrogens summed into heavy atoms:
elementType: O O N N N N C C C C C C C C C C C C C C C C
charge: -0.278928 -0.278982 -0.097390 -0.097217 -0.069681 -0.071555 0.044250 0.036727 0.036396 0.044152 0.054722 0.053017 -0.071050 -0.069008 0.015021 0.015728 0.060138 0.061619 0.243803 0.245315 0.061841 0.061081
polarizability: 2.15962320e+02 4.51040390e+00 2.32524190e+02 3.57410186e+00 -7.94328705e-01 1.70862479e+02
1716.lowfreq: -15.1359 -11.6790 -6.9383 -4.2563 -1.0972 -0.0009 -0.0002 0.0006 14.0627
frequency: -13.2528 -6.0720 13.5197 17.7801 21.1732 27.4288 36.2835 52.3508 59.6133 70.9095 80.5580 97.8411 105.1332 113.4672 118.0847 129.9952 154.3272 158.3934 189.8309 245.2388 257.8746 272.2636 276.0060 308.8236 330.1959 356.4818 365.8446 394.2385 400.0408 440.4683 447.4913 485.2075 518.4032 555.9324 557.5483 605.6580 618.8472 664.5309 670.8134 719.7605 731.2816 736.7691 761.0581 787.7480 790.2084 800.4072 811.5667 816.7221 821.3987 832.0239 860.3733 887.7485 899.6047 919.9275 959.5690 969.2359 975.0710 984.5459 986.5802 990.8746 1034.1126 1037.5479 1056.5436 1058.4134 1062.2556 1062.4642 1069.9631 1071.3889 1079.2049 1079.5770 1098.6397 1101.6310 1105.8806 1119.2122 1125.0832 1127.0903 1140.8167 1141.8074 1151.8886 1186.2465 1188.3764 1212.0745 1226.1485 1230.5797 1241.9071 1257.9121 1260.2140 1263.0336 1279.5802 1280.4016 1286.0491 1286.3393 1290.5898 1308.2090 1310.1967 1319.6165 1345.4254 1348.2173 1361.1704 1362.2110 1367.9576 1369.3366 1444.4778 1445.5189 1446.4599 1447.6533 1453.6056 1453.8751 1454.5095 1458.4775 1464.8982 1465.8078 1467.9572 1480.1269 1482.4929 1484.6349 1485.5268 1487.1742 1612.3028 1612.4139 2923.1106 2923.5469 2946.6473 2952.9424 2973.9661 2974.7970 2988.2846 2991.0529 2992.5204 2993.8826 2994.5408 3012.1383 3029.2562 3030.7382 3040.8622 3048.2722 3052.4937 3052.5446 3058.9763 3060.6187 3062.2196 3062.7367 3072.7186 3073.4654 3163.2485 3163.3989 3180.7633 3180.9425 3560.2179 3560.7518
redmass: 3.6135 4.9458 5.0176 5.6921 6.5641 3.2731 3.0979 3.0767 3.6773 3.3515 2.0408 3.4175 2.9100 2.6557 2.8498 2.9724 2.4487 2.8032 4.4580 3.8036 3.9920 3.0273 2.8288 3.3851 2.5590 2.8871 2.5008 2.7151 2.6627 3.0115 2.9080 2.3895 1.8458 1.3321 1.3725 2.9734 2.8319 4.2871 4.2627 1.3353 2.3322 2.1247 1.4867 1.3304 1.3686 2.6487 2.7674 1.3876 1.3560 2.4903 2.4490 3.2435 1.9904 2.8249 1.9188 1.2808 1.3721 1.6854 1.8623 2.0182 2.2136 2.4038 2.1567 2.0747 1.3355 1.3692 2.3754 2.3519 1.3345 1.3437 2.3993 2.4151 2.3327 2.0234 1.8445 2.0844 1.4816 1.4688 1.4173 1.5127 1.5276 1.2804 1.4950 1.5330 1.3126 2.0609 2.9341 1.9038 1.2223 1.2206 1.1287 1.0942 1.2129 1.4250 1.4315 1.2752 1.4651 1.5713 1.4020 1.3722 1.3500 1.3713 1.1392 1.0974 1.1225 1.1122 1.0807 1.0853 1.0843 1.0706 1.0921 1.1501 1.1489 1.1400 1.1084 1.1056 1.7336 1.8459 6.1677 6.2147 1.0665 1.0666 1.0585 1.0595 1.0617 1.0635 1.0925 1.0598 1.0597 1.0652 1.0652 1.0994 1.0931 1.0932 1.1001 1.1014 1.0511 1.0510 1.1007 1.1005 1.0627 1.0631 1.1009 1.1012 1.1147 1.1145 1.1155 1.1154 1.0779 1.0779
irintensity: 0.9961 0.0588 1.0357 7.3219 1.0713 1.9329 5.4052 3.0198 5.4702 1.5070 1.6484 0.3879 0.9314 5.3829 0.0299 4.2251 6.6902 10.2890 4.6985 0.4865 3.8113 3.0972 1.1905 4.8034 4.7797 13.4967 6.9258 5.8299 4.6429 3.1413 5.6756 5.4231 33.6070 57.4956 154.5128 12.4326 6.7183 6.2109 5.0247 4.8815 3.4461 16.4259 3.1977 3.7724 3.8633 3.1673 0.4480 4.6690 2.9241 10.6992 14.2341 2.7248 0.6660 1.5257 7.2321 8.0582 0.4326 23.8669 12.7140 32.1691 11.5320 5.9148 5.8279 14.8520 5.5821 7.5047 8.6145 7.4938 15.3458 9.8769 7.4912 1.4335 1.6021 16.6085 3.1775 5.7114 0.4222 0.4095 0.2119 23.5523 36.4729 0.6893 42.3678 25.3369 5.3609 76.4956 9.9760 1.0896 4.3865 7.8828 4.5388 3.0926 9.0984 29.0159 30.5567 47.1108 1.9831 0.0634 26.0954 36.9996 8.9137 6.9025 58.7020 19.2449 25.7290 15.2583 9.5585 7.8772 5.6414 3.4088 0.9928 0.8009 0.4889 27.0332 8.4741 11.6238 112.1558 324.1247 269.0309 37.3814 32.4449 36.7949 1.1216 40.1575 7.2713 72.7850 6.0011 18.0489 15.4369 54.6904 27.5426 3.8884 13.6510 12.7750 0.6666 164.0202 37.9279 18.4489 48.9345 48.6589 25.1619 23.3556 10.7198 10.8838 1.9583 2.0130 42.5634 43.1666 14.1134 14.4303
temp: 298.150 k
press: 1.00000 atm
elementType: 8 8 7 7 7 7 6 6 6 6 6 6 6 6 6 6 6 6 6 6 6 6 1 1 1 1 1 1 1 1 1 1 1 1 1 1 1 1 1 1 1 1 1 1 1 1 1 1 1 1 1 1
symmnumber: 1
zpe: 1180331.1 jmol-1
zpe.correction: 0.449564 hartree
zpe.thermalcorrener: 0.473632 hartree
zpe.thermalcorrenthalpy: 0.474576 hartree
zpe.thermalcorrgfe: 0.390148 hartree
zpe.sumelectzpe: -995.309042 hartree
zpe.sumelectthermal: -995.284975 hartree
zpe.sumelectthermalent: -995.284031 hartree
zpe.sumelectthermalfe: -995.368459 hartree
dipole: -0.3996 -1.5769 0.0643
dipole: 1.6280
quadrupole: -142.8581 -117.0787 -147.7046
quadrupole: 0.9411 -16.2778 -0.6421
quadrupole: -6.9776 18.8017 -11.8241 0.9411 -16.2778 -0.6421
hfenergy: -995.7586066 hartree
pointgroup: C01 [X(C16H30N4O2)]
dipole: -0.0707641 0.6358 -0.0316139 debye
polarizability: 215.1072717|-2.1269622|233.4252785|-3.2674241|-0.8810163|170.8164388 unknown
InChI: InChI=1S/C16H30N4O2/c21-15(5-9-19-11-12-19)17-7-3-1-2-4-8-18-16(22)6-10-20-13-14-20/h17-18H,1-14H2
charge 0 multiplicity 1
52 atoms
O  4.2308 0.184193 -1.641482
O  -4.651606 1.295549 1.560457
N  5.526091 -3.031489 1.002332
N  -5.325002 -2.284784 -0.831613
N  3.486414 1.297807 0.260826
N  -3.702467 2.26329 -0.329755
C  6.516474 -4.052296 0.500865
C  5.026695 -4.251484 0.262101
C  -6.77165 -2.60377 -0.530404
C  -5.671341 -3.582764 -0.146314
C  5.472959 -1.756604 0.233286
C  -4.710681 -1.243198 0.038677
C  4.101366 -1.086689 0.457646
C  -4.94325 0.144587 -0.592558
C  0.769066 2.892076 0.23188
C  -0.6803 3.078228 -0.271838
C  1.794609 2.762878 -0.915757
C  -1.702582 3.234147 0.875148
C  3.949706 0.171186 -0.401652
C  -4.422573 1.266332 0.310191
C  3.254523 2.574682 -0.438804
C  -3.161615 3.427007 0.39697
H  7.131452 -3.793976 -0.372821
H  7.032153 -4.627596 1.275904
H  4.463083 -4.969977 0.865283
H  4.663991 -4.118273 -0.76722
H  -7.261233 -2.057098 0.28829
H  -7.402502 -2.798262 -1.403297
H  -5.506292 -4.486955 -0.74018
H  -5.443406 -3.681303 0.92447
H  6.280258 -1.103141 0.613773
H  5.629184 -1.88997 -0.862197
H  -5.114658 -1.234988 1.077295
H  -3.626719 -1.455507 0.098774
H  3.30927 -1.801325 0.159635
H  3.964916 -0.875861 1.53436
H  -4.486127 0.174038 -1.598952
H  -6.033261 0.292466 -0.724962
H  0.810137 1.987804 0.87411
H  1.044576 3.75248 0.87828
H  -0.724901 3.97072 -0.932031
H  -0.955256 2.205686 -0.899862
H  1.756405 3.674715 -1.546697
H  1.527385 1.91159 -1.5714
H  -1.666308 2.349683 1.540296
H  -1.427761 4.111304 1.496388
H  3.930647 2.580933 -1.311609
H  3.545469 3.403752 0.235168
H  -3.233796 4.315567 -0.259766
H  -3.816031 3.585007 1.271995
H  3.269114 1.227724 1.255634
H  -3.520327 2.17318 -1.329962
