program: Gaussian 09
title: 000179013
version: EM64L-G09RevD.01
frameworkgroup: C1[X(C17H21N3)]
method: RPBEPBE
basis: SDD
operation: Freq
keyword: #pfreq=noraman
keyword: PBEPBE/SDD
title: #p freq=noraman PBEPBE/SDD
converged: YES YES NO NO
title: Mulliken charges:
elementType: N N N C C C C C C C C C C C C C C C C C H H H H H H H H H H H H H H H H H H H H H
charge: -0.169081 -0.000154 -0.003931 0.377233 -0.485952 -0.120949 -0.458831 -0.420970 -0.446796 -0.531004 -0.387062 -0.260104 0.447796 -0.199380 -0.701076 -0.371940 -0.436635 -0.230339 -0.218570 -0.240145 0.242551 0.214644 0.292408 0.247582 0.226398 0.219391 0.226373 0.204952 0.226476 0.228868 0.247125 0.217745 0.234739 0.209746 0.216036 0.223823 0.246071 0.244756 0.226978 0.230603 0.230626
chargesum: 0.00000
title: Mulliken charges with hydrogens summed into heavy atoms:
elementType: N N N C C C C C C C C C C C C C C C C C
charge: -0.169081 -0.000154 -0.003931 0.377233 -0.028757 0.171459 0.015149 0.024794 -0.015368 -0.055011 0.065422 -0.260104 0.447796 -0.199380 -0.051471 -0.125869 -0.191879 -0.003361 0.012034 -0.009519
polarizability: 2.23346942e+02 -7.57356581e-01 1.68984894e+02 -3.71707535e+00 -2.24134748e+01 1.72638286e+02
1716.lowfreq: -5.8822 -0.0004 0.0002 0.0006 3.8619 10.0435 25.6380 32.3114 45.6549
frequency: 25.0693 32.2580 45.5916 66.0524 70.4875 87.4111 95.0519 116.2187 129.3110 137.0227 157.8249 203.3875 219.7609 231.4707 248.6777 285.7612 298.4184 313.3030 339.3500 363.5498 370.7328 404.3654 413.3757 432.7847 473.4860 494.2653 551.0203 585.9011 607.2862 616.7226 625.9592 647.9452 674.0967 705.0849 745.4166 751.7134 775.9548 802.4457 814.8090 857.9042 861.4996 874.9735 891.5421 911.4708 919.4527 947.1859 957.5103 980.8082 990.1040 995.1400 1000.4377 1024.9030 1032.1618 1054.4000 1058.8650 1068.7752 1084.5966 1091.7821 1108.0449 1121.4244 1146.2470 1155.9630 1172.4848 1185.5892 1194.8704 1206.6885 1215.5790 1243.4940 1253.4646 1282.9385 1284.8505 1295.4525 1308.5351 1321.1683 1335.4186 1340.1971 1346.7840 1353.3629 1359.9631 1365.0137 1386.8309 1390.3580 1442.4884 1450.7178 1458.3590 1462.7301 1473.9312 1475.2509 1476.9471 1478.0079 1485.2886 1488.1351 1594.4792 1613.9957 2161.1057 2169.1388 2924.7959 2975.0196 2982.0280 2989.6805 2990.2841 2992.0243 2996.9930 3007.8433 3030.6023 3051.6520 3054.8114 3065.9020 3069.1619 3074.5453 3075.2937 3079.7263 3121.4878 3124.3097 3136.7847 3147.6406 3164.4066
redmass: 4.5994 3.8735 4.3984 4.9999 4.7392 2.4610 2.9210 7.5081 4.7375 3.6424 3.9191 3.3110 3.1092 1.3275 3.2200 3.8361 3.7644 2.3738 2.3546 3.9526 3.9899 2.8175 3.8073 3.9863 2.5837 3.4995 6.2393 5.4736 4.4620 6.2796 3.8272 4.2611 3.7303 1.8705 1.4015 1.6604 2.1606 2.9097 3.3087 1.2485 1.6739 1.9409 2.0347 1.8090 1.3876 1.7691 2.3303 1.3892 5.6414 1.8650 1.5074 2.3525 2.7241 2.4283 2.2343 2.2643 1.9327 1.9654 2.3085 1.8999 2.6549 2.6359 1.0574 1.1107 1.5323 1.4974 2.4684 1.3302 1.4730 1.2761 1.3584 1.2460 1.2554 1.2610 1.2821 1.3329 1.4396 1.4686 1.5175 1.3955 4.6409 1.2078 2.1179 1.0841 1.0812 1.0843 1.0836 1.0700 1.2496 1.0883 1.5100 1.1480 6.0986 6.0775 12.6761 12.5521 1.0714 1.0359 1.0601 1.0593 1.0642 1.0618 1.0726 1.0720 1.0992 1.0990 1.1017 1.0887 1.1012 1.1012 1.1009 1.0995 1.0851 1.0881 1.0917 1.0962 1.1015
irintensity: 0.8587 0.2778 1.9206 1.3417 1.1992 0.4465 1.3353 2.9328 2.4807 3.1755 0.9516 3.2531 1.3967 0.4358 0.0808 0.6947 4.6895 1.0439 4.0536 1.1354 0.9805 0.2009 0.4732 1.7191 2.0716 9.7571 4.7266 2.2745 2.3943 0.3935 1.3411 3.2889 1.9744 45.4156 2.2571 40.0187 22.2405 10.8887 5.5134 0.4017 3.8499 7.0591 16.6438 6.7798 2.2408 11.9615 10.2856 0.6017 0.3253 8.4418 5.0082 19.7743 8.8248 2.4444 31.1035 10.8227 6.7751 2.9166 12.8964 15.3475 19.3453 13.2181 0.1068 0.7584 3.4503 4.6715 10.1743 5.2868 10.2059 2.9113 4.2343 8.4732 2.5841 2.7014 1.8740 1.3369 1.8315 0.1984 3.6517 6.6107 1.8665 10.0527 9.9323 9.4314 3.8620 10.9490 12.3752 8.9910 17.6102 6.9964 13.9069 6.0228 1.0305 3.9807 1.4156 0.9021 27.0162 36.4565 0.5867 64.6822 4.5242 16.0929 5.2317 22.2214 0.1081 34.3386 6.7730 13.4015 23.6764 57.5021 26.1705 60.5654 4.7664 0.4093 12.3921 34.1089 24.2569
temp: 298.150 k
press: 1.00000 atm
elementType: 7 7 7 6 6 6 6 6 6 6 6 6 6 6 6 6 6 6 6 6 1 1 1 1 1 1 1 1 1 1 1 1 1 1 1 1 1 1 1 1 1
symmnumber: 1
zpe: 898534.0 jmol-1
zpe.correction: 0.342234 hartree
zpe.thermalcorrener: 0.361998 hartree
zpe.thermalcorrenthalpy: 0.362942 hartree
zpe.thermalcorrgfe: 0.292836 hartree
zpe.sumelectzpe: -823.140671 hartree
zpe.sumelectthermal: -823.120906 hartree
zpe.sumelectthermalent: -823.119962 hartree
zpe.sumelectthermalfe: -823.190069 hartree
dipole: -0.6133 -3.9992 5.4092
dipole: 6.7549
quadrupole: -111.0969 -130.4427 -124.6780
quadrupole: -3.4268 8.3621 11.4256
quadrupole: 10.9757 -8.3702 -2.6055 -3.4268 8.3621 11.4256
hfenergy: -823.4829045 hartree
pointgroup: C01 [X(C17H21N3)]
dipole: 0.4015409 1.7811562 1.9310866 debye
polarizability: 223.3104566|-2.9952556|174.2341771|3.9114379|22.0487237|167.425488 unknown
InChI: InChI=1S/C17H21N3/c1-2-10-17(14-19)11-6-9-16(12-18)20(17)13-15-7-4-3-5-8-15/h3-5,7-8,16H,2,6,9-11,13H2,1H3
charge 0 multiplicity 1
41 atoms
N  -0.26884 -0.036845 0.319409
N  -2.725881 -1.182727 -1.960372
N  0.124819 -3.3499 -0.973458
C  -1.753744 0.159314 0.168051
C  -2.478211 -0.310991 1.470028
C  0.190932 -1.357293 0.838403
C  -2.063351 -1.718054 1.934211
C  -0.540146 -1.760704 2.140751
C  -2.065123 1.679542 -0.069624
C  0.569282 0.414918 -0.836814
C  -3.565734 2.053249 -0.060463
C  -2.3020 -0.60608 -1.004505
C  2.038181 0.564186 -0.455009
C  0.124474 -2.468226 -0.168572
C  -3.782812 3.520158 -0.491658
C  2.414845 1.384448 0.640276
C  3.048354 -0.083861 -1.206605
C  3.775816 1.556498 0.973081
C  4.413139 0.08916 -0.876954
C  4.780538 0.910256 0.212901
H  -3.567287 -0.271618 1.299202
H  -2.233003 0.428597 2.257646
H  1.267064 -1.230223 1.065015
H  -2.36758 -2.475547 1.185415
H  -2.587188 -1.96795 2.874922
H  -0.243379 -1.041911 2.927753
H  -0.200804 -2.764907 2.45106
H  -1.65427 1.997532 -1.045583
H  -1.523744 2.240463 0.717482
H  0.189205 1.395893 -1.164264
H  0.47367 -0.278518 -1.703139
H  -3.994346 1.904661 0.948211
H  -4.119535 1.384098 -0.748144
H  -3.24344 4.218702 0.175679
H  -3.418661 3.689549 -1.522246
H  -4.854301 3.788035 -0.465079
H  1.631814 1.873557 1.231799
H  2.766253 -0.72977 -2.047042
H  4.055808 2.193906 1.819586
H  5.184526 -0.419335 -1.465826
H  5.837263 1.044239 0.469875
