program: Gaussian 09
title: 000178988
version: EM64L-G09RevD.01
frameworkgroup: C1[X(C8H15BrO2)]
method: RPBEPBE
basis: SDD
operation: Freq
keyword: #p
keyword: freq=noraman
keyword: PBEPBE/SDD
title: #p freq=noraman PBEPBE/SDD
converged: YES YES NO NO
title: Mulliken charges:
elementType: Br O O C C C C C C C C H H H H H H H H H H H H H H H
charge: -0.031577 -0.253452 -0.248726 -0.052471 0.329536 -0.365920 -0.373566 -0.351520 -0.698653 -0.711594 -0.704633 0.238777 0.234254 0.179979 0.180850 0.236024 0.225878 0.233732 0.234818 0.214404 0.234848 0.216153 0.246618 0.216214 0.283710 0.286316
chargesum: 0.00000
title: Mulliken charges with hydrogens summed into heavy atoms:
elementType: Br O O C C C C C C C C
charge: -0.031577 -0.253452 -0.248726 0.186306 0.329536 0.048313 0.043308 0.108090 -0.014584 -0.032608 -0.134606
polarizability: 1.54113935e+02 4.18029402e+00 8.61543941e+01 5.18414302e+00 1.63398420e+00 8.29125682e+01
1716.lowfreq: -11.6875 -0.0007 -0.0006 -0.0004 5.7017 16.1727 42.5931 61.1281 76.6321
frequency: 42.4284 61.1172 76.6135 131.1698 140.3421 161.6252 192.6986 243.4626 266.2627 279.3867 313.7045 338.5388 402.9722 427.8961 464.0186 475.4916 485.7974 604.6273 659.0666 688.2549 742.5662 760.3526 867.1058 901.0272 903.9335 922.7545 946.6545 961.9867 993.5269 1010.0697 1037.8851 1059.2163 1094.6405 1121.8518 1145.5114 1158.1016 1189.3533 1207.5604 1232.5993 1250.2166 1264.9822 1283.6060 1289.7455 1320.0988 1345.9242 1352.3520 1370.9590 1377.3697 1390.1051 1449.5399 1450.9167 1456.1030 1464.6838 1465.4756 1472.2110 1485.1093 1488.5642 2938.9905 2945.7105 2987.5909 3000.7717 3004.1901 3011.1766 3045.6320 3054.4848 3070.4243 3075.3089 3097.9802 3102.8129 3116.6141 3122.8740 3139.5055
redmass: 4.2005 2.7383 3.1453 3.5195 1.0762 7.9783 1.1537 1.8626 2.6032 3.1238 3.1273 3.1682 2.6092 1.8927 3.6669 5.0561 3.9160 5.3670 3.5458 4.8489 2.4695 1.2908 2.3329 1.5627 2.0724 1.4395 1.7327 5.2002 1.3377 5.5939 1.8081 3.4380 2.2260 2.3396 1.9105 1.5828 2.5501 1.1727 1.1837 1.5622 1.5029 1.4381 1.2674 1.3107 1.2410 1.3952 1.3179 1.2995 1.2470 1.0587 1.0954 1.0590 1.0652 1.0638 1.0836 1.0779 1.0573 1.0682 1.0679 1.0608 1.0389 1.0779 1.0353 1.1019 1.0572 1.0943 1.0955 1.0985 1.1006 1.1002 1.1004 1.1109
irintensity: 1.2064 2.1514 0.4341 3.4553 0.1460 0.9344 0.9785 0.5066 6.2780 6.0681 3.6050 1.4311 1.2953 5.6078 5.4035 3.0199 14.7341 44.8212 1.7204 9.3242 31.3569 26.9821 7.7085 5.0748 7.5779 1.2232 10.7192 19.7946 2.4617 90.6492 12.2596 46.3456 4.7489 21.5321 60.4516 4.8600 136.6524 6.5080 11.5746 16.0252 44.4328 1.0083 10.4190 10.9532 7.3341 0.9320 31.4816 17.6225 39.4381 4.8300 4.4667 0.0751 4.4841 8.3982 7.5350 17.5031 3.7120 30.9047 62.6258 11.4021 5.9120 38.0387 12.4951 17.0392 14.3416 34.9467 38.3151 32.9185 5.8663 26.3924 20.5928 12.7806
temp: 298.150 k
press: 1.00000 atm
elementType: 35 8 8 6 6 6 6 6 6 6 6 1 1 1 1 1 1 1 1 1 1 1 1 1 1 1
symmnumber: 1
zpe: 576625.2 jmol-1
zpe.correction: 0.219625 hartree
zpe.thermalcorrener: 0.232254 hartree
zpe.thermalcorrenthalpy: 0.233199 hartree
zpe.thermalcorrgfe: 0.179427 hartree
zpe.sumelectzpe: -476.840211 hartree
zpe.sumelectthermal: -476.827582 hartree
zpe.sumelectthermalent: -476.826637 hartree
zpe.sumelectthermalfe: -476.880409 hartree
dipole: -1.1200 0.1016 1.0411
dipole: 1.5325
quadrupole: -89.1479 -79.3271 -76.2519
quadrupole: -0.1242 -5.9556 0.5149
quadrupole: -7.5723 2.2486 5.3237 -0.1242 -5.9556 0.5149
hfenergy: -477.059836 hartree
pointgroup: C01 [X(C8H15Br1O2)]
dipole: 0.4496202 0.0189441 -0.401277 debye
dipolederiv: -0.688936 -0.0309339 -0.0436769 0.0566991 -0.153949 0.0155862 -0.135823 0.0030378 -0.1675985 -1.0956523 -0.1593503 0.0307978 -0.0999079 -0.5924022 -0.0302467 0.0908285 -0.0245903 -0.4616637 -1.0577492 0.2272296 0.0641855 0.1851214 -0.7013317 -0.0091019 0.1106491 -0.0220986 -0.4588068 -0.1501269 -0.0100607 -0.0145213 -0.1848951 -0.0975124 -0.0038558 0.1155967 0.0200693 0.1114504 1.0971483 -0.0025185 -0.1115423 -0.0242643 0.8924785 0.031219 -0.366902 0.0534098 0.7118892 0.6487821 0.0372469 0.0188871 -0.1750048 0.2225977 0.0079051 0.0320343 0.0821852 0.3570454 0.6548258 -0.1343438 0.0015762 0.1441314 0.2812359 -0.0254571 0.0139157 -0.1217749 0.3477587 -0.205897 -0.0537849 -0.0108626 0.0663244 0.0679839 0.0507227 -0.0853963 0.0237659 0.0865642 -0.0760244 0.0031193 0.014749 -0.0020167 -0.0376763 0.0139469 0.1327348 0.0017191 -0.3027838 -0.1650567 0.0304879 -0.0685329 0.0340895 0.0305165 0.0169454 -0.0941761 0.0217685 -0.0807164 0.9279736 -0.0492244 0.1414731 -0.0485343 0.1129129 -0.0154129 0.1651997 -0.0153988 0.1652509 0.0718359 -0.0033121 0.0151207 0.0156354 0.0373094 0.0159772 0.0302053 0.0068835 -0.1378774 -0.0194387 -0.1023117 0.0234819 -0.1122562 -0.0696702 0.0287117 0.0457674 0.0590462 0.0558076 -0.0254174 0.0066766 -0.0269288 0.0634874 0.0541823 0.0402452 -0.0708767 -0.0422704 -0.2035791 -0.0374712 0.0184234 -0.0275576 -0.0402196 0.0593282 0.0011818 -0.0527658 0.0968281 -0.1972497 0.0095198 0.0786143 0.02198 0.0562823 -0.0953195 -0.0559405 0.033325 -0.0927277 0.0431 0.0700042 -0.0009471 0.0301842 -0.0363935 0.0682836 -0.0104302 0.0146968 0.0128329 -0.1327007 0.042199 0.0428873 0.0057949 0.0536365 -0.1149356 -0.0387331 0.0294597 -0.0449318 0.0648924 0.0476254 0.0771258 0.0464661 0.1067375 -0.0626502 -0.0687407 0.0415044 -0.0410928 0.0734672 -0.069824 0.0316001 -0.1373638 0.0301273 0.0889914 0.0239639 -0.1232427 0.0202339 0.012678 -0.0074011 -0.1009953 0.0481201 -0.127478 -0.018864 0.0401315 0.0322388 0.0156676 0.0844085 -0.0187754 -0.0855708 0.0100609 -0.137164 -0.0210325 0.0289498 0.0272392 0.0526561 0.0916429 0.1007461 -0.0010845 0.0588721 -0.0000344 0.1122586 0.0062291 0.0275642 0.0108011 -0.107602 0.0399334 0.0673593 0.0095322 0.1188045 -0.0652007 -0.0484828 0.0259018 -0.0770322 0.0783609 -0.0497889 0.0200258 -0.0802611 0.0148217 0.0821724 0.0052735 -0.0124906 0.0278503 -0.0995171 -0.0430345 0.0936418 -0.0200344 0.0422704 -0.0797072 -0.0205872 -0.0271879 -0.0268379 0.0657788 unknown
polarizability: 153.8101869|-4.1813022|86.0294366|6.9166807|-1.8928483|83.3412737 unknown
InChI: InChI=1S/C8H15BrO2/c1-8(2)10-5-7(3-4-9)6-11-8/h7H,3-6H2,1-2H3
charge 0 multiplicity 1
26 atoms
Br -5.041428 -0.016809 -0.26891
O  1.276669 -1.249515 0.280047
O  1.609701 1.151623 0.441527
C  -0.710775 0.247486 0.373377
C  2.17685 -0.12306 -0.053222
C  -0.110428 -1.065673 -0.180651
C  0.234298 1.407633 -0.016392
C  -2.141808 0.52534 -0.161333
C  2.457965 -0.060468 -1.569502
C  3.435335 -0.354401 0.778258
C  -3.168614 -0.466559 0.392437
H  -0.723941 0.180446 1.479402
H  -0.637371 -1.958371 0.194125
H  -0.165952 -1.066518 -1.29242
H  0.20457 1.571228 -1.116623
H  -0.054779 2.347353 0.483057
H  -2.146951 0.486876 -1.268223
H  -2.443725 1.551738 0.123512
H  2.919886 -1.007642 -1.896401
H  1.546147 0.100302 -2.169551
H  3.155837 0.767935 -1.779459
H  4.154693 0.46481 0.613794
H  3.16378 -0.384504 1.845277
H  3.902912 -1.313226 0.499572
H  -3.244486 -0.428092 1.490192
H  -3.006185 -1.50133 0.055908
