program: Gaussian 09
title: 000178984
version: EM64L-G09RevD.01
frameworkgroup: C1[X(C7H14N2O2)]
method: RPBEPBE
basis: SDD
operation: Freq
keyword: #p
keyword: freq=noraman
keyword: PBEPBE/SDD
title: #p freq=noraman PBEPBE/SDD
converged: YES YES NO NO
title: Mulliken charges:
elementType: O O N N C C C C C C C H H H H H H H H H H H H H H
charge: -0.437511 -0.285340 -0.068106 0.041549 -0.107180 -0.404809 -0.394868 -0.425825 -0.382743 -0.374050 -0.376320 0.201649 0.238559 0.226338 0.215975 0.186465 0.208933 0.209961 0.202681 0.228370 0.275373 0.237596 0.204398 0.246176 0.332727
chargesum: 0.00000
title: Mulliken charges with hydrogens summed into heavy atoms:
elementType: O O N N C C C C C C C
charge: -0.104783 -0.285340 -0.068106 0.041549 0.094469 0.060088 0.007572 -0.006931 0.048308 0.138919 0.074254
polarizability: 9.73554683e+01 2.65068786e+00 1.03510265e+02 7.96980845e+00 3.23758894e+00 8.33971617e+01
1716.lowfreq: -25.3649 -12.4078 -0.0008 -0.0007 -0.0006 11.0697 36.9724 86.7840 170.0748
frequency: 36.7486 86.7014 170.0736 185.0592 203.5973 227.4267 262.7930 308.8914 313.8871 331.9785 371.6274 401.6682 432.1199 450.0796 481.8652 588.9461 649.6650 720.9066 747.9452 819.1755 834.9386 869.1741 887.1734 918.3514 957.2910 990.5999 1009.7361 1031.6264 1037.2066 1100.7595 1118.1575 1122.5509 1143.2863 1163.5682 1223.8107 1231.2925 1243.5378 1254.4270 1272.4662 1296.6066 1308.2136 1330.4559 1342.0889 1345.1969 1349.8038 1357.9880 1364.5818 1371.5604 1395.3489 1448.3742 1455.4596 1470.8124 1476.6761 1479.2854 1484.3901 2926.6788 2963.7255 2967.1307 2976.8084 2982.6280 3005.2045 3013.1091 3023.4379 3029.0163 3041.8098 3044.5358 3064.9987 3075.9708 3551.9521
redmass: 5.8011 4.0996 2.5016 3.0757 3.4756 2.7517 4.1134 3.8325 1.1094 2.7131 3.0851 2.3779 3.2079 2.7028 1.7537 2.6762 3.5462 3.1006 2.7685 2.9058 1.6994 1.9719 2.0780 2.1615 2.4040 2.7232 2.1696 2.4140 2.0615 1.9603 1.9888 1.9987 1.5203 1.2597 1.3513 1.3409 1.5392 1.4559 1.1783 1.6856 1.3713 1.5529 1.3989 1.8024 1.4026 1.4608 1.4155 1.5988 1.6208 1.0878 1.0883 1.0817 1.0803 1.0824 1.0833 1.0831 1.0645 1.0648 1.0624 1.0655 1.0654 1.0647 1.0947 1.0915 1.0981 1.0939 1.1017 1.1039 1.0661
irintensity: 2.1268 0.4885 2.7589 5.4841 0.7449 3.2079 13.5925 2.5940 145.1435 10.5223 3.9499 1.2501 5.7452 4.9315 4.5713 1.0055 0.9684 6.0618 3.3721 8.2853 11.0967 2.5231 24.8165 47.5738 21.3111 59.8150 19.1289 40.3194 19.6962 1.9471 10.4715 11.6623 42.9746 19.6915 23.7987 11.6272 3.7445 6.6878 3.4824 86.1961 14.9270 6.7850 7.1482 33.0290 0.5037 13.7627 3.1010 10.4285 6.6837 6.3017 9.5237 19.6644 2.1986 8.8555 34.3496 50.2861 23.8702 25.6871 33.8829 61.9610 12.1173 24.0142 46.5587 23.7930 40.9237 26.9198 39.3434 21.0084 2.6254
temp: 298.150 k
press: 1.00000 atm
elementType: 8 8 7 7 6 6 6 6 6 6 6 1 1 1 1 1 1 1 1 1 1 1 1 1 1
symmnumber: 1
zpe: 557130.6 jmol-1
zpe.correction: 0.212200 hartree
zpe.thermalcorrener: 0.223313 hartree
zpe.thermalcorrenthalpy: 0.224257 hartree
zpe.thermalcorrgfe: 0.175495 hartree
zpe.sumelectzpe: -534.122750 hartree
zpe.sumelectthermal: -534.111637 hartree
zpe.sumelectthermalent: -534.110693 hartree
zpe.sumelectthermalfe: -534.159455 hartree
dipole: 3.7120 2.5369 4.4103
dipole: 6.2981
quadrupole: -74.2888 -64.4288 -67.5601
quadrupole: -7.5666 -1.5668 -6.2148
quadrupole: -5.5295 4.3304 1.1991 -7.5666 -1.5668 -6.2148
hfenergy: -534.33495 hartree
pointgroup: C01 [X(C7H14N2O2)]
dipole: -1.5482401 0.9409583 -1.6903674 debye
dipolederiv: -0.5907067 -0.0439682 0.2041781 -0.0737221 -0.6867575 0.2168047 0.2578931 0.2341088 -0.3150261 -0.3992875 0.046062 -0.1173869 0.6886914 -0.8058474 0.4760526 -0.2312523 0.1038798 -0.3622597 -0.6598176 0.4228564 -0.3085513 0.1285751 -0.359868 -0.0085182 -0.2366333 0.276012 -0.4127064 0.5642196 -0.4563791 0.4920972 -0.7323503 0.4451436 -0.5115274 0.635844 -0.4100563 0.3614526 0.4899425 0.0730879 -0.077754 0.0986535 0.6211568 -0.1036397 -0.1151957 -0.101865 0.3278471 0.0360487 -0.0384805 -0.0267811 -0.0590373 -0.0354532 -0.0177485 -0.017836 -0.0418643 0.0152933 0.0659157 -0.0144524 0.0406335 -0.0147189 0.0909451 0.0057258 0.036226 -0.0210406 0.1261299 0.0023211 -0.0163867 0.044615 0.000308 0.0643384 -0.074973 0.1062399 0.0039239 -0.0165333 0.1100392 -0.005759 0.036986 0.0119038 0.0567276 -0.0011234 0.0014729 -0.0031294 0.0574336 0.2049212 0.053386 -0.0128961 0.0700007 0.1561879 0.1573133 -0.135889 0.1751541 0.1482022 0.1190841 -0.0646196 -0.0419513 -0.112202 0.4881104 -0.0575141 -0.0210747 -0.0724033 0.2349029 -0.2037151 0.0649515 -0.0811007 0.054419 -0.0475561 0.0476295 -0.0652106 0.0524963 -0.045312 -0.0283123 0.0465164 -0.1020296 0.0460673 0.0195559 0.0367918 -0.0948009 0.0240955 0.0429108 -0.0733682 -0.0014612 0.1303725 0.0057938 0.0417222 -0.0225842 0.1206124 -0.0161303 -0.0337994 -0.0101153 0.0679292 0.0637212 0.0520398 -0.0929378 -0.085388 0.0886597 -0.1249214 -0.0048137 -0.0101807 -0.0122738 -0.0787656 -0.0323491 0.0651057 0.0170369 -0.1191353 0.0663874 -0.139186 0.0316376 0.0012861 0.0370721 0.037949 -0.0634694 0.1562827 0.0286914 0.1277371 0.0086352 -0.0309345 -0.0658447 -0.0588941 -0.0798315 -0.0785908 -0.1468134 -0.0445695 -0.0997481 -0.00595 0.0232792 -0.0168364 0.022209 -0.0339302 -0.2095724 0.0648937 0.0490541 0.0780583 0.0614311 -0.0111407 0.0030652 -0.0594218 0.0317394 0.0875556 0.0318816 -0.0599053 -0.0236294 -0.095497 0.115824 0.00317 -0.0300544 -0.0401428 0.0279996 0.0077051 -0.0070288 0.066675 0.0427283 -0.069567 0.0429947 0.0686027 -0.0273287 0.0451054 -0.0840147 0.0462519 -0.0985735 -0.0775527 0.0766718 0.0458628 -0.110892 0.0486597 0.0127939 -0.0295588 -0.0671212 -0.0016753 -0.1148139 -0.0984369 -0.0897116 0.0654978 -0.014831 -0.0040992 0.0163168 -0.0068153 -0.0212221 0.0871756 0.3456777 -0.0449953 -0.0995061 -0.0543566 0.1617036 -0.0910313 -0.1484773 -0.1722691 0.1093078 unknown
polarizability: 97.9694827|-3.2494787|103.2553706|7.8663592|-2.2040644|83.0380419 unknown
InChI: InChI=1S/C7H14N2O2/c10-7-3-1-2-5-9(8-11)6-4-7/h7,10H,1-6H2
charge 0 multiplicity 1
25 atoms
O  -2.12668 -1.798676 0.621168
O  2.500518 -1.484908 0.785758
N  1.269531 -0.016875 -0.403991
N  2.323787 -0.247274 0.465434
C  -1.960724 -0.545897 -0.147877
C  -1.536793 0.501408 0.897777
C  -1.224536 1.909836 0.315348
C  -0.984966 -0.756402 -1.330627
C  0.280623 2.252378 0.194335
C  0.451923 -1.137532 -0.934375
C  1.119595 1.402961 -0.791737
H  -2.94204 -0.24225 -0.579404
H  -0.666043 0.109718 1.454502
H  -2.362674 0.565855 1.629545
H  -1.68048 2.675313 0.971862
H  -1.717464 2.036569 -0.671818
H  -1.001214 0.136254 -1.985144
H  -1.378332 -1.584237 -1.95665
H  0.382614 3.309424 -0.12602
H  0.755068 2.175722 1.19218
H  0.440974 -1.916383 -0.148953
H  0.982903 -1.574446 -1.805088
H  0.69262 1.447771 -1.80935
H  2.138829 1.825259 -0.8398
H  -2.503943 -2.497689 0.028126
