program: Gaussian 09
title: 000178989
version: EM64L-G09RevD.01
frameworkgroup: C1[X(C11H12O4S)]
method: RPBEPBE
basis: SDD
operation: Freq
keyword: #p
keyword: freq=noraman
keyword: PBEPBE/SDD
title: #p freq=noraman PBEPBE/SDD
converged: YES YES NO NO
title: Mulliken charges:
elementType: S O O O O C C C C C C C C C C C H H H H H H H H H H H H
charge: -0.059850 -0.305345 -0.290353 -0.433065 -0.273186 0.551442 0.208249 0.191913 -0.546255 -0.357295 -0.358081 -0.199288 -0.341745 -0.529373 -0.530297 0.241518 0.254393 0.253300 0.253564 0.273978 0.250329 0.226485 0.233392 0.259780 0.228022 0.232763 0.174738 0.390264
chargesum: 0.00000
title: Mulliken charges with hydrogens summed into heavy atoms:
elementType: S O O O O C C C C C C C C C C C
charge: 0.114889 -0.305345 -0.290353 -0.042801 -0.273186 0.551442 0.208249 0.191913 -0.291862 -0.103994 -0.104516 0.074690 -0.341745 0.180833 0.190268 0.241518
polarizability: 3.16446189e+02 -2.19293077e+00 1.54577298e+02 -1.99658991e+00 5.30816742e+00 7.37366322e+01
1716.lowfreq: -14.3639 -5.0930 0.0009 0.0013 0.0022 2.7426 27.6534 41.7499 72.1498
frequency: 27.2998 41.6402 72.1424 86.9821 99.7961 108.8438 125.8163 154.0807 158.1651 179.3046 198.6703 217.6477 240.9318 282.4458 303.2624 349.3713 357.2441 389.7937 407.8932 420.6424 468.3078 488.7523 550.1912 564.2337 566.7466 618.2994 636.9592 654.2200 708.8549 718.7946 751.0014 756.9560 827.5130 847.0149 885.3275 896.4269 940.9170 942.7070 956.1186 960.6542 982.4460 1089.1187 1104.6412 1112.5954 1113.9574 1149.7592 1155.7159 1168.3227 1211.1038 1251.6066 1283.1158 1323.1492 1325.8211 1385.3447 1403.8055 1423.8080 1441.2278 1457.4448 1460.0451 1475.8196 1485.8775 1486.9492 1553.0994 1591.7757 1600.7982 1613.5640 2360.1772 2972.4982 2979.9053 3067.9763 3079.3312 3121.0874 3123.1032 3128.1292 3144.5743 3157.2529 3184.0638 3538.6428
redmass: 6.0199 4.4797 5.8239 7.0653 4.7702 2.9261 3.2168 1.1212 1.1207 3.9034 7.6164 6.3260 4.8114 6.0505 6.8800 1.9730 1.8780 3.4174 5.6726 8.9789 2.7874 3.4863 6.4239 1.3588 4.3033 4.6535 3.1961 5.1323 7.4907 5.7370 3.4175 5.1966 1.5290 1.3566 1.5936 3.7535 1.5670 7.2686 1.4352 5.2456 4.0369 2.7117 1.9169 1.2757 1.2570 1.3536 1.4020 1.4708 1.7341 2.7142 2.5543 2.3118 2.4691 2.7415 2.3256 1.1823 1.3608 1.0528 1.0676 1.0573 2.2233 1.1809 6.2131 7.6743 6.7911 6.8960 1.0370 1.0306 1.0307 1.1047 1.1040 1.0876 1.1025 1.1035 1.0917 1.0892 1.0950 1.0643
irintensity: 0.1506 1.3206 1.8986 0.7526 2.3542 10.9449 0.5529 0.1259 0.0896 5.2757 3.6754 7.9226 14.8184 5.0353 3.4520 10.2976 12.3855 14.6424 16.4926 9.0204 45.9742 5.1301 28.8124 118.5432 12.0313 10.8352 24.4530 36.0374 29.7046 8.0347 11.3320 22.2596 35.2563 30.8903 2.4496 17.7556 32.9585 90.6571 2.8400 138.1312 96.3386 221.3925 326.1466 7.8249 2.4727 1.1750 5.8084 13.2292 29.2399 245.5745 145.0815 28.7876 34.7353 15.6482 55.5848 1.4687 9.3666 14.8500 11.4483 7.6007 108.0087 106.8261 69.6249 450.3048 77.1588 96.3507 30.4409 72.3467 90.1650 27.3549 21.6028 2.3056 24.9654 23.0603 2.8019 4.8156 2.4624 77.8364
temp: 298.150 k
press: 1.00000 atm
elementType: 16 8 8 8 8 6 6 6 6 6 6 6 6 6 6 6 1 1 1 1 1 1 1 1 1 1 1 1
symmnumber: 1
zpe: 541128.5 jmol-1
zpe.correction: 0.206105 hartree
zpe.thermalcorrener: 0.222911 hartree
zpe.thermalcorrenthalpy: 0.223855 hartree
zpe.thermalcorrgfe: 0.160564 hartree
zpe.sumelectzpe: -1124.093508 hartree
zpe.sumelectthermal: -1124.076702 hartree
zpe.sumelectthermalent: -1124.075757 hartree
zpe.sumelectthermalfe: -1124.139048 hartree
dipole: -2.8536 1.7675 0.1248
dipole: 3.3590
quadrupole: -91.6782 -93.7299 -102.7000
quadrupole: 5.1420 -0.1111 -3.3702
quadrupole: 4.3579 2.3061 -6.6640 5.1420 -0.1111 -3.3702
hfenergy: -1124.2996128 hartree
pointgroup: C01 [X(C11H12O4S1)]
dipole: -1.0351569 0.6159111 0.5436119 debye
polarizability: 313.3840391|-22.0204944|116.6172945|-6.8756497|41.834703|114.7587858 unknown
InChI: InChI=1S/C11H12O4S/c1-14-8-4-3-7(5-9(8)15-2)6-10(16)11(12)13/h3-6,12,16H,1-2H3
charge 0 multiplicity 1
28 atoms
S  3.058688 -1.708412 -1.609416
O  -2.77537 1.301677 1.275317
O  -3.756492 -0.49691 -0.836043
O  4.257074 0.778063 1.371979
O  5.416034 -0.601223 -0.085747
C  0.427046 -0.118874 -0.064959
C  -1.90142 0.534673 0.467423
C  -2.387735 -0.346769 -0.546378
C  -0.52102 0.623544 0.704923
C  -0.075628 -0.951195 -1.113389
C  -1.459336 -1.058281 -1.340158
C  1.834165 0.052879 0.281939
C  2.983719 -0.50506 -0.23744
C  -3.526786 2.345194 0.536072
C  -4.606424 -0.958958 0.29059
C  4.310241 -0.145016 0.318896
H  -0.182903 1.296302 1.501337
H  0.605089 -1.525591 -1.745184
H  -1.853384 -1.709289 -2.126867
H  2.02002 0.75064 1.109135
H  -4.126131 1.901279 -0.27967
H  -2.825728 3.093468 0.120964
H  -4.182248 2.817953 1.282917
H  -4.491244 -0.303222 1.17098
H  -4.336549 -1.997837 0.556522
H  -5.637246 -0.924178 -0.092246
H  4.448328 -1.787046 -1.553509
H  5.186542 0.954991 1.677014
