program: Gaussian 09
title: 000178986
version: EM64L-G09RevD.01
frameworkgroup: C1[X(C16H23N)]
method: RPBEPBE
basis: SDD
operation: Freq
keyword: #pfreq=noraman
keyword: PBEPBE/SDD
title: #p freq=noraman PBEPBE/SDD
converged: YES YES NO NO
title: Mulliken charges:
elementType: N C C C C C C C C C C C C C C C C H H H H H H H H H H H H H H H H H H H H H H H
charge: -0.097613 -0.090769 -0.237938 -0.476768 -0.500074 -0.395393 -0.377180 0.321866 -0.568424 0.280121 -0.330401 -0.411623 -0.376989 -0.403391 -0.261976 -0.251530 -0.693632 0.221301 0.229242 0.223468 0.216515 0.212925 0.222483 0.194276 0.202904 0.179386 0.201639 0.219841 0.221353 0.165052 0.195740 0.235251 0.214990 0.201037 0.229965 0.223664 0.224165 0.207283 0.209906 0.219326
chargesum: 0.00000
title: Mulliken charges with hydrogens summed into heavy atoms:
elementType: N C C C C C C C C C C C C C C C C
charge: -0.097613 0.130532 -0.008695 -0.036785 -0.064666 0.001786 0.003845 0.321866 -0.127230 0.280121 0.030391 -0.176372 0.039039 -0.173425 -0.038311 -0.027365 -0.057116
polarizability: 2.16915825e+02 -6.53506628e+00 1.66205156e+02 -9.88910670e+00 -1.51846682e+01 1.32069074e+02
1716.lowfreq: -15.0714 -8.8365 -0.0004 -0.0002 0.0007 4.7462 42.0741 57.8378 74.7024
frequency: 41.9802 57.8175 74.6550 92.8368 120.9061 165.2043 183.7160 208.6189 220.3453 237.6622 256.1453 290.6619 310.0611 333.4948 347.9841 385.6190 418.3128 450.0425 456.7882 504.9385 526.3490 536.5419 582.9324 620.7051 631.6711 720.3348 734.3098 751.7413 765.4569 782.9280 827.6930 840.4001 847.9264 874.6226 881.4963 885.1181 900.9726 932.0742 948.0590 949.9333 980.6776 984.5028 1019.2836 1023.9873 1039.2403 1044.5188 1056.9986 1092.2315 1099.6152 1112.6728 1121.2669 1125.3745 1133.1439 1161.9992 1169.6626 1173.7295 1185.7931 1201.0592 1206.7532 1216.7501 1231.3002 1248.0875 1259.4311 1263.7231 1288.1651 1297.0199 1304.6359 1313.7834 1318.8183 1326.5743 1339.4407 1341.0289 1346.0941 1350.5524 1378.7958 1381.3638 1386.8361 1395.2143 1438.4044 1453.7867 1457.7721 1464.7126 1471.8570 1476.5931 1479.4753 1482.9027 1486.7397 1487.5728 1494.4919 1588.0117 1612.3788 2832.4928 2846.2899 2951.1652 2968.6404 2972.6602 2979.1489 2980.1523 2984.0361 2989.1719 2991.8835 2994.2778 3015.5716 3016.0713 3034.4558 3036.2562 3047.4919 3051.7629 3069.9868 3075.3709 3106.1374 3110.3370 3132.8759 3155.8112
redmass: 3.3930 3.4525 1.7116 3.3093 3.1546 2.8370 2.7185 2.4686 1.8527 1.2743 3.5733 2.9729 2.2279 2.9022 3.4523 3.4541 3.1512 2.6519 2.8679 3.8677 3.1315 3.1938 3.7385 2.3510 4.3959 3.1983 2.2627 1.1142 1.6164 2.3087 2.9160 2.0478 1.9342 1.5046 1.4416 1.6705 1.6344 2.2490 2.2324 1.4015 2.4531 1.3201 1.7484 2.2175 2.3637 2.8016 2.0554 2.0736 2.2556 1.8619 1.6370 2.6196 2.1698 1.5435 1.5942 1.1041 1.7634 2.2430 1.5617 1.4305 1.6404 1.2760 1.5230 1.2385 1.3417 1.1846 1.3644 1.3053 1.3896 1.3976 1.4502 1.4690 1.4589 1.4914 2.0799 2.3610 1.3756 1.2944 2.3804 1.0917 1.1360 1.0860 1.0747 1.0723 1.0426 1.0768 1.1388 2.0999 1.0889 6.7831 6.3517 1.0706 1.0710 1.0648 1.0791 1.0364 1.0618 1.0668 1.0641 1.0783 1.0752 1.0705 1.0876 1.0913 1.0993 1.1010 1.1030 1.1025 1.1010 1.0994 1.0863 1.0890 1.0923 1.1004
irintensity: 0.0325 0.0557 0.0226 0.2457 0.1042 0.6141 0.3938 3.0370 1.0018 1.2394 0.1928 0.3219 0.2329 0.6478 1.1293 2.4324 1.8371 7.2862 6.2771 1.9809 0.6040 2.9264 1.6367 1.2895 5.4227 0.8029 24.1763 4.5778 51.6887 1.1812 6.5480 1.3039 11.0169 1.2840 1.5205 2.6676 2.8822 5.4258 13.0531 0.4319 7.5587 0.0674 5.6070 0.7865 10.3905 2.6176 12.6405 14.7118 12.3708 18.6646 6.0236 12.7853 13.7244 8.6267 8.3066 0.5251 12.2192 5.7651 0.2286 1.8279 5.2721 1.5441 5.1723 7.0995 3.2641 13.0427 0.4492 3.7307 1.5166 5.5770 0.3053 3.5171 2.3040 7.4923 5.8394 0.9934 4.3516 11.6639 5.5630 8.4468 4.9351 12.0031 0.8833 0.4261 11.7566 14.5030 3.9726 27.4870 11.2142 4.0823 1.1045 35.5969 155.7876 28.5406 11.2103 44.7034 28.8995 9.5184 30.8976 17.8305 18.5081 76.1922 75.5248 36.8640 45.4215 13.7973 26.1320 77.4970 76.4855 48.0200 18.3759 2.5334 29.8165 39.2545
temp: 298.150 k
press: 1.00000 atm
elementType: 7 6 6 6 6 6 6 6 6 6 6 6 6 6 6 6 6 1 1 1 1 1 1 1 1 1 1 1 1 1 1 1 1 1 1 1 1 1 1 1
symmnumber: 1
zpe: 929234.8 jmol-1
zpe.correction: 0.353927 hartree
zpe.thermalcorrener: 0.369527 hartree
zpe.thermalcorrenthalpy: 0.370472 hartree
zpe.thermalcorrgfe: 0.311365 hartree
zpe.sumelectzpe: -676.955675 hartree
zpe.sumelectthermal: -676.940075 hartree
zpe.sumelectthermalent: -676.939131 hartree
zpe.sumelectthermalfe: -676.998237 hartree
dipole: -0.7504 -0.1728 0.7305
dipole: 1.0614
quadrupole: -101.4845 -100.3343 -104.5505
quadrupole: -0.1170 -1.9157 -2.6969
quadrupole: 0.6385 1.7888 -2.4274 -0.1170 -1.9157 -2.6969
hfenergy: -677.3096023 hartree
pointgroup: C01 [X(C16H23N1)]
dipole: -0.2963687 -0.0789606 0.2834134 debye
polarizability: 217.6571694|-4.0890571|165.5095398|-7.8590707|-15.9033778|132.0233457 unknown
InChI: InChI=1S/C16H23N/c1-2-11-17-12-5-8-15-14-7-4-3-6-13(14)9-10-16(15)17/h3-4,6-7,15-16H,2,5,8-12H2,1H3
charge 0 multiplicity 1
40 atoms
N  -2.177694 0.580002 -0.124419
C  -0.857878 -0.105187 -0.025604
C  0.278883 0.858949 -0.464265
C  0.217046 2.202766 0.322262
C  -0.517584 -0.738067 1.356884
C  -1.184242 2.835897 0.206351
C  -2.266658 1.836526 0.657625
C  1.658382 0.212648 -0.333283
C  0.741846 -1.621134 1.222451
C  1.888064 -0.924294 0.493254
C  -3.362026 -0.292147 0.066822
C  2.753428 0.782663 -1.034181
C  -3.447387 -1.469077 -0.927878
C  3.203742 -1.443165 0.605423
C  4.056643 0.256378 -0.922668
C  4.285484 -0.8649 -0.090407
C  -4.810629 -2.189922 -0.840154
H  -0.877677 -0.934733 -0.760147
H  0.098383 1.105896 -1.530946
H  0.992397 2.890162 -0.066028
H  0.464907 2.024727 1.387781
H  -1.363196 -1.355953 1.714766
H  -0.346889 0.049494 2.114623
H  -1.2458 3.755016 0.820801
H  -1.379801 3.11876 -0.846342
H  -2.172935 1.663536 1.761174
H  -3.271062 2.269595 0.488435
H  0.472628 -2.540679 0.659754
H  1.084707 -1.963316 2.218178
H  -3.439329 -0.695982 1.110511
H  -4.255625 0.347284 -0.081313
H  2.573658 1.65036 -1.682225
H  -3.28718 -1.076853 -1.950749
H  -2.64028 -2.202232 -0.733433
H  3.376762 -2.316545 1.247802
H  4.884747 0.711903 -1.477365
H  5.293556 -1.282745 0.01099
H  -4.996364 -2.57124 0.182233
H  -5.640477 -1.505557 -1.09895
H  -4.854048 -3.049938 -1.532764
