program: Gaussian 09
title: 000178983
version: EM64L-G09RevD.01
frameworkgroup: C1[X(C16H17NO2)]
method: RPBEPBE
basis: SDD
operation: Freq
keyword: #p
keyword: freq=noraman
keyword: PBEPBE/SDD
title: #p freq=noraman PBEPBE/SDD
converged: YES YES NO NO
title: Mulliken charges:
elementType: O O N C C C C C C C C C C C C C C C C H H H H H H H H H H H H H H H H H
charge: -0.257047 -0.261084 -0.501964 0.176966 0.361318 0.330920 -0.412822 -0.420507 -0.235157 -0.824462 -0.840035 0.269997 0.116987 -0.355198 -0.349756 0.330953 -0.355346 -0.363507 -0.537114 0.308726 0.231477 0.230967 0.224481 0.219406 0.288919 0.216993 0.247611 0.220281 0.237130 0.273118 0.230930 0.245163 0.253496 0.225760 0.224536 0.247863
chargesum: 0.00000
title: Mulliken charges with hydrogens summed into heavy atoms:
elementType: O O N C C C C C C C C C C C C C C C C
charge: -0.257047 -0.261084 -0.193238 0.176966 0.361318 0.330920 -0.181345 -0.189540 -0.010675 -0.099144 -0.135012 0.269997 0.116987 -0.082081 -0.118826 0.330953 -0.110183 -0.110011 0.161045
polarizability: 3.13022177e+02 -3.60047096e+00 1.58953329e+02 8.00605826e-01 7.31705308e+00 1.26547265e+02
1716.lowfreq: -12.2682 -7.1311 -4.9243 -0.0005 -0.0001 0.0006 26.4343 31.8175 48.1774
frequency: 26.2962 31.6846 48.1606 83.2128 98.6620 114.2028 134.8412 160.2147 171.2062 188.3249 200.1633 221.1873 229.8209 271.3797 288.6740 307.2083 322.1610 337.4870 390.9737 415.6330 467.1545 482.9392 504.6100 515.3493 518.9286 529.8153 544.0941 584.4583 596.2060 628.5063 681.2832 687.3250 727.3385 753.4778 770.6595 777.4517 821.6795 827.7904 841.6898 862.4464 898.0482 929.8630 957.1718 973.5905 975.7178 984.9204 986.0983 999.6931 1038.1999 1043.5384 1050.7279 1076.3452 1104.8810 1111.5051 1115.3044 1157.4351 1175.7680 1176.7930 1224.0861 1238.1658 1252.5215 1263.9265 1279.5653 1303.5925 1368.7314 1371.7967 1396.3009 1397.9359 1421.8291 1433.1178 1437.8524 1448.5318 1456.1013 1467.6127 1468.3529 1471.3729 1472.1706 1485.3615 1490.7139 1503.1291 1568.5061 1600.0791 1605.4842 1608.6056 1621.5224 2957.1027 2964.9595 2976.8308 3036.5175 3055.2602 3057.8647 3085.9585 3088.5633 3120.9891 3125.8320 3129.6072 3130.9290 3148.6445 3156.4750 3166.8701 3169.9249 3521.1158
redmass: 4.4646 3.6366 4.7604 3.6853 4.2070 4.9754 4.1275 1.0988 2.3227 1.8777 2.2893 1.1934 2.4919 3.3359 3.6649 5.1443 3.4362 3.9798 5.6385 2.9544 3.0982 3.7314 3.8017 3.1272 4.5690 3.9210 2.8066 3.6879 1.7254 6.0283 4.3150 5.0765 4.0257 4.4791 5.3540 1.2496 1.4036 2.9108 2.1336 4.7887 1.3096 2.5503 1.3779 1.3388 1.3670 8.2806 1.6109 2.8455 1.7037 1.6441 1.5854 3.1246 1.7829 1.2603 1.3547 1.3354 1.2248 1.1664 3.9824 3.5463 2.0736 2.1775 2.3819 1.3001 6.2580 5.3319 1.2547 1.2520 4.0751 1.5645 1.4388 1.7241 1.3056 1.0502 1.4442 1.0963 1.0877 1.2653 1.4869 2.3158 6.8519 6.3358 6.0934 5.9702 6.5875 1.0431 1.0328 1.0364 1.0914 1.1042 1.0970 1.0998 1.0977 1.0856 1.0892 1.0997 1.0919 1.0879 1.0995 1.0951 1.0961 1.0754
irintensity: 1.1615 0.8012 0.3624 0.9647 2.5963 5.5990 5.2886 1.1232 2.8373 1.4456 8.7672 0.4786 1.3081 6.2296 1.6323 2.4699 3.6359 0.1091 0.2090 0.2635 1.0817 4.1293 23.9571 1.8224 3.2171 5.4745 21.6266 27.4787 58.5918 1.6611 28.3471 2.2590 11.0480 18.4421 7.5389 53.8421 4.5452 10.9730 47.2053 14.9151 0.1079 4.9088 0.4963 0.2393 2.8486 52.1189 6.7963 10.1989 4.7686 3.8503 8.1364 1.1502 32.1650 0.2671 14.6434 0.3452 174.4195 10.1931 31.5930 179.7332 110.7480 94.8505 50.3977 2.8686 68.8652 11.6348 42.9877 2.8276 18.3633 56.8899 7.2958 139.6171 20.8927 13.6012 198.1845 50.8272 15.1379 53.0281 93.8396 10.7307 10.1051 69.0175 9.3918 98.0867 116.9667 34.6511 71.9377 24.4570 19.8016 44.0148 9.9695 26.4397 23.5263 0.5705 16.3043 24.1093 26.7653 3.0376 39.7895 10.4614 6.7635 11.0859
temp: 298.150 k
press: 1.00000 atm
elementType: 8 8 7 6 6 6 6 6 6 6 6 6 6 6 6 6 6 6 6 1 1 1 1 1 1 1 1 1 1 1 1 1 1 1 1 1
symmnumber: 1
zpe: 762444.2 jmol-1
zpe.correction: 0.290400 hartree
zpe.thermalcorrener: 0.308482 hartree
zpe.thermalcorrenthalpy: 0.309426 hartree
zpe.thermalcorrgfe: 0.243547 hartree
zpe.sumelectzpe: -823.745532 hartree
zpe.sumelectthermal: -823.727449 hartree
zpe.sumelectthermalent: -823.726505 hartree
zpe.sumelectthermalfe: -823.792385 hartree
dipole: -2.7789 2.2334 0.8443
dipole: 3.6638
quadrupole: -85.5759 -110.0382 -114.1497
quadrupole: 5.1862 9.6576 -2.3304
quadrupole: 17.6787 -6.7836 -10.8951 5.1862 9.6576 -2.3304
hfenergy: -824.0359315 hartree
pointgroup: C01 [X(C16H17N1O2)]
dipole: 1.0880677 -0.4868489 0.8104666 debye
polarizability: 312.9666467|-4.2869514|139.290312|2.0082089|-17.4516352|146.2658123 unknown
InChI: InChI=1S/C16H17NO2/c1-11-5-4-6-12(2)15(11)17-16(18)13-7-9-14(19-3)10-8-13/h4-10,17H,1-3H3
charge 0 multiplicity 1
36 atoms
O  -0.380587 0.347043 -1.881664
O  5.492414 -0.04466 0.842587
N  -0.972048 -0.046807 0.353826
C  -2.402124 -0.033255 0.216806
C  -3.077509 1.098023 -0.328892
C  -3.122894 -1.168139 0.699957
C  -4.492154 1.049037 -0.412208
C  -4.533681 -1.165209 0.613216
C  -5.21962 -0.066854 0.050098
C  -2.33549 2.336212 -0.784017
C  -2.389187 -2.364981 1.281177
C  1.401109 0.108779 -0.247274
C  -0.0403 0.156372 -0.673432
C  2.372688 -0.156442 -1.243192
C  1.840922 0.338917 1.086957
C  4.163256 -0.006729 0.408598
C  3.744524 -0.22123 -0.930521
C  3.205607 0.28179 1.415107
C  6.530581 -0.31594 -0.157233
H  -0.607067 -0.444707 1.22225
H  -5.02307 1.910456 -0.834128
H  -5.092973 -2.035316 0.976587
H  -6.312849 -0.078653 -0.020471
H  -1.540694 2.616787 -0.067663
H  -1.83481 2.154428 -1.752566
H  -3.025725 3.190258 -0.891435
H  -1.606021 -2.733837 0.592713
H  -1.893468 -2.129456 2.245722
H  -3.089581 -3.19408 1.476143
H  2.025492 -0.304805 -2.271093
H  1.126091 0.610403 1.872947
H  4.468241 -0.433882 -1.722667
H  3.55766 0.469688 2.433757
H  6.541488 0.46165 -0.944976
H  6.39287 -1.312731 -0.618722
H  7.477511 -0.292732 0.401108
