program: Gaussian 09
title: 000179004
version: EM64L-G09RevD.01
frameworkgroup: C1[X(C15H24N2OS)]
method: RPBEPBE
basis: SDD
operation: Freq
keyword: #p
keyword: freq=noraman
keyword: PBEPBE/SDD
title: #p freq=noraman PBEPBE/SDD
converged: YES YES NO NO
title: Mulliken charges:
elementType: S O N N C C C C C C C C C C C C C C C H H H H H H H H H H H H H H H H H H H H H H H H
charge: 0.137954 -0.233765 -0.074531 0.069928 -0.403485 -0.421833 -0.332877 -0.329649 -0.338870 -0.335281 -0.031706 -0.694921 -0.693728 -0.452492 0.499582 -0.314328 -0.804568 -0.159196 -0.362478 0.205542 0.246130 0.216263 0.251930 0.185589 0.233025 0.189597 0.221628 0.202470 0.189352 0.203873 0.190992 0.210122 0.216764 0.217967 0.209972 0.218481 0.216290 0.242140 0.213114 0.283855 0.238302 0.229583 0.243264
chargesum: 0.00000
title: Mulliken charges with hydrogens summed into heavy atoms:
elementType: S O N N C C C C C C C C C C C C C C C
charge: 0.137954 -0.233765 -0.074531 0.069928 0.048187 0.046360 0.085737 0.081576 0.052952 0.059584 -0.031706 -0.050068 -0.048985 -0.452492 0.499582 -0.072188 -0.069297 0.070387 -0.119214
polarizability: 2.58370321e+02 1.81672740e+01 1.78563854e+02 4.92254688e+00 6.97007940e-01 1.68767675e+02
1716.lowfreq: -7.7058 -0.0022 -0.0008 0.0007 4.6240 6.8005 20.1807 23.3174 26.8252
frequency: 19.0249 23.1944 26.7076 32.6877 60.8040 64.1568 70.7032 81.8452 96.7424 109.4069 114.4798 144.9477 155.3293 174.9956 197.8376 223.1331 235.9522 239.4258 246.1517 263.9382 282.5761 300.8254 375.2519 386.0788 395.5060 409.2089 429.2028 447.1506 470.7038 519.4741 536.0867 546.1936 620.9877 656.3888 683.6202 735.3041 737.3950 759.4227 788.4003 792.8963 798.6526 801.4113 881.3305 901.7857 902.7572 925.4746 926.3525 938.7682 981.3785 985.7292 1011.2372 1021.7080 1045.1134 1052.4318 1054.0309 1071.1042 1076.2643 1096.9227 1110.3233 1114.1183 1115.5933 1130.6603 1194.5242 1196.6855 1205.2912 1243.3320 1265.3337 1266.3779 1268.9512 1273.0322 1289.0554 1292.2257 1303.0174 1314.7647 1340.0457 1344.8735 1358.2709 1362.8581 1378.9871 1390.2542 1392.1846 1393.6443 1396.6048 1425.6865 1450.3140 1457.3466 1467.7011 1468.4660 1472.3061 1476.5030 1478.2332 1478.3559 1481.5368 1482.4456 1488.0593 1490.0516 1543.9464 1578.1545 1631.3316 2964.2288 2965.4419 2974.9334 2975.1968 2976.1901 2976.9811 2984.6143 2990.0726 2997.0012 3009.3532 3010.7694 3033.9811 3043.6760 3058.3328 3070.4732 3072.9137 3073.2066 3074.7149 3075.7890 3077.2291 3089.3723 3129.7735 3138.5391 3165.9699
redmass: 4.7857 3.9330 4.0340 4.0010 2.2187 4.4708 1.5643 2.5978 7.1434 2.4027 2.4602 2.3283 2.9491 1.3610 3.4120 2.6006 1.1033 1.2583 4.8159 3.4138 3.6715 3.8934 4.2142 3.2257 2.7704 5.8587 3.5819 3.9331 4.5261 4.4430 3.9473 5.6760 10.4318 7.2725 4.4681 1.0884 1.0728 4.9947 1.2178 1.1944 1.7052 2.4664 3.3477 1.7281 1.8073 1.2246 1.3465 1.3380 1.3808 1.6159 3.9393 3.8787 2.8247 2.2096 2.2517 2.5041 2.4932 1.7570 2.1702 2.3679 1.8940 1.6359 1.8431 2.2296 1.6976 1.6689 1.2994 1.2770 1.8022 1.3633 1.0696 1.0816 1.2411 9.7529 1.3736 1.4574 1.4494 1.3911 1.9407 1.2123 1.2193 1.2627 1.9819 2.3116 1.0886 1.0719 1.0797 1.0737 1.0728 1.0673 1.0420 1.0430 1.1054 1.0830 1.0826 1.0907 4.5536 6.1776 8.7724 1.0590 1.0590 1.0492 1.0408 1.0468 1.0590 1.0359 1.0619 1.0630 1.0974 1.0966 1.1009 1.0989 1.1046 1.1014 1.1008 1.0974 1.1004 1.0997 1.1026 1.1002 1.0871 1.0922 1.1003
irintensity: 1.4987 0.5710 0.1309 0.3179 0.9477 1.4083 0.1568 2.5442 2.7028 0.6602 0.1821 0.4563 0.5275 1.1637 1.3928 1.6602 0.1350 0.0601 2.0113 7.7876 2.1908 7.1392 4.5007 2.3395 0.7830 7.2497 4.1738 0.7557 6.8672 14.3116 6.3535 4.3223 12.9236 14.7276 39.1379 9.3030 16.7380 4.6232 0.8557 3.4215 50.4612 15.6685 14.7320 12.0805 14.8721 4.6249 0.4195 51.8697 0.0319 11.6456 4.9327 9.6405 12.7408 72.6661 30.3376 0.2050 0.3945 65.1302 61.3108 15.7985 81.8993 16.7314 28.8367 21.6719 41.4984 26.3720 6.0088 0.7270 0.1516 47.6468 2.2993 2.2698 13.7236 2.7110 0.2229 0.6673 12.6858 13.5675 124.1674 8.8896 16.5436 18.0386 18.0739 19.8004 21.1113 16.0853 1.4115 1.6149 2.2781 6.2495 12.2953 13.5460 23.7379 14.3477 15.7893 23.3824 15.3655 6.5507 266.7981 26.5919 19.7699 25.5743 19.1806 44.8543 24.4162 22.1817 57.4504 40.6262 5.7843 10.9018 4.8336 12.0241 27.1575 13.9097 89.7669 7.3339 36.8146 47.2502 98.0590 20.1340 3.1245 22.3569 39.7352
temp: 298.150 k
press: 1.00000 atm
elementType: 16 8 7 7 6 6 6 6 6 6 6 6 6 6 6 6 6 6 6 1 1 1 1 1 1 1 1 1 1 1 1 1 1 1 1 1 1 1 1 1 1 1 1
symmnumber: 1
zpe: 955019.5 jmol-1
zpe.correction: 0.363748 hartree
zpe.thermalcorrener: 0.385996 hartree
zpe.thermalcorrenthalpy: 0.386940 hartree
zpe.thermalcorrgfe: 0.308834 hartree
zpe.sumelectzpe: -1167.313805 hartree
zpe.sumelectthermal: -1167.291557 hartree
zpe.sumelectthermalent: -1167.290612 hartree
zpe.sumelectthermalfe: -1167.368719 hartree
dipole: 1.8364 0.5822 1.5998
dipole: 2.5042
quadrupole: -99.5734 -123.9991 -124.2914
quadrupole: 3.9168 -5.3604 1.9597
quadrupole: 16.3812 -8.0444 -8.3367 3.9168 -5.3604 1.9597
hfenergy: -1167.6775525 hartree
pointgroup: C01 [X(C15H24N2O1S1)]
dipole: 0.6965324 0.2773963 0.6391799 debye
polarizability: 259.0772371|15.4206053|177.2262684|8.0812871|0.2884263|169.3983441 unknown
InChI: InChI=1S/C15H24N2OS/c1-4-6-11-17(12-7-5-2)15(18)19-14-13(3)9-8-10-16-14/h8-10H,4-7,11-12H2,1-3H3
charge 0 multiplicity 1
43 atoms
S  -0.848585 1.135869 -0.885422
O  -0.462583 -1.012088 0.848354
N  1.489121 -0.007596 0.048561
N  -3.040222 -0.120923 -1.878499
C  2.334948 -0.938027 0.843338
C  2.172303 0.983304 -0.814091
C  2.67237 -2.23992 0.082113
C  2.4646 2.324053 -0.100253
C  3.573974 -3.180686 0.913255
C  3.228451 3.31205 -1.010475
C  0.123156 -0.146593 0.146787
C  3.913893 -4.487535 0.164673
C  3.527228 4.653581 -0.307265
C  -2.548867 0.408632 -0.732624
C  -3.265436 0.478162 0.497739
C  -4.573015 -0.075188 0.482359
C  -2.694121 1.090565 1.754851
C  -5.101262 -0.640915 -0.697873
C  -4.302487 -0.635422 -1.861894
H  3.262097 -0.398531 1.117464
H  1.792229 -1.183844 1.773064
H  3.122612 0.528059 -1.15433
H  1.561133 1.161128 -1.718226
H  3.175924 -1.993987 -0.875176
H  1.726692 -2.754834 -0.172146
H  3.055764 2.131994 0.818315
H  1.507498 2.777875 0.222221
H  3.064917 -3.423668 1.867954
H  4.512341 -2.653309 1.183174
H  2.633897 3.499405 -1.927489
H  4.180179 2.84875 -1.343527
H  4.454404 -4.277364 -0.777457
H  4.550042 -5.150952 0.778715
H  2.993951 -5.044162 -0.093885
H  4.146511 4.499079 0.596392
H  4.070344 5.346917 -0.975025
H  2.59137 5.151374 0.008302
H  -5.170551 -0.053845 1.400903
H  -3.485784 1.275531 2.501241
H  -1.946926 0.406359 2.196108
H  -2.177101 2.041856 1.537084
H  -6.107969 -1.070182 -0.72037
H  -4.665338 -1.050069 -2.808739
