program: Gaussian 09
title: 000178982
version: EM64L-G09RevD.01
frameworkgroup: C1[X(C7H16N4O3)]
method: RPBEPBE
basis: SDD
operation: Freq
keyword: #p
keyword: freq=noraman
keyword: PBEPBE/SDD
title: #p freq=noraman PBEPBE/SDD
converged: YES YES NO NO
title: Mulliken charges:
elementType: O O O N N N N C C C C C C C H H H H H H H H H H H H H H H H
charge: -0.464080 -0.426286 -0.304301 -0.556047 -0.083798 -0.700442 -0.611407 -0.066212 -0.435474 -0.417416 -0.209285 -0.447105 0.158923 0.147610 0.258589 0.196578 0.270509 0.213723 0.200397 0.270225 0.160343 0.227317 0.330127 0.272882 0.270299 0.425600 0.338510 0.316453 0.354678 0.309093
chargesum: 0.00000
title: Mulliken charges with hydrogens summed into heavy atoms:
elementType: O O O N N N N C C C C C C C
charge: -0.133953 -0.000687 -0.304301 -0.012866 -0.083798 -0.045479 0.052363 0.192377 0.031613 -0.003296 0.060940 -0.059445 0.158923 0.147610
polarizability: 1.15706590e+02 4.00941210e+00 1.25546687e+02 -1.97576887e+00 3.40870475e+00 1.02037093e+02
1716.lowfreq: -8.5127 -0.0009 -0.0007 0.0003 4.7169 11.0728 57.1469 85.8410 100.2878
frequency: 57.0551 85.8182 100.2842 125.0488 145.1094 166.0219 184.8245 193.1232 197.6704 221.6742 253.7754 275.6858 294.8929 310.0227 326.7378 363.0820 415.3861 416.8010 432.3919 450.8496 503.0514 513.6501 530.6994 561.7951 621.2895 634.1273 682.7294 697.1722 720.1302 787.3764 795.8473 813.4390 878.7037 888.3131 932.1720 946.5476 991.7113 1010.2112 1018.2843 1035.0550 1066.5250 1091.0245 1095.4442 1123.1757 1153.1285 1161.3813 1176.6825 1190.7462 1204.0779 1230.2529 1252.1440 1285.4962 1309.8588 1315.1491 1343.9585 1355.4691 1361.7804 1368.5711 1402.2025 1444.5977 1450.1613 1451.9059 1468.4270 1597.5663 1602.7659 1641.2745 1649.5979 1677.1888 2639.4677 2895.4934 2978.8112 2989.7797 3009.3068 3015.9427 3047.0623 3061.3888 3073.4215 3426.7004 3432.1406 3434.7483 3554.6189 3555.7305 3567.4812 3620.1498
redmass: 5.2401 4.7095 4.5160 6.0682 5.2075 4.0941 3.8226 5.6671 1.2765 3.5021 3.1330 3.0049 2.3679 1.2529 2.7409 2.7782 1.9026 2.8189 1.3708 2.6831 2.0146 3.0446 1.8760 3.5806 2.8075 2.5192 1.6589 1.8225 3.2053 3.4100 2.0169 3.5459 2.2335 1.7119 2.4749 2.4897 2.3597 2.2528 1.4001 1.9449 1.9486 1.4134 2.0770 2.3116 2.3387 1.6981 1.2831 1.5294 1.5053 1.3860 1.3450 1.3371 1.3067 1.2156 1.3201 1.6333 2.0097 1.4564 1.4598 1.1186 1.3527 1.1250 1.1019 2.7561 1.3831 1.2972 1.0910 3.6068 1.0761 1.0677 1.0606 1.0629 1.0851 1.0892 1.1017 1.0879 1.0963 1.0541 1.0451 1.0461 1.0956 1.0662 1.0975 1.0911
irintensity: 1.1910 0.4833 1.4304 0.5275 3.4491 5.6579 15.0895 9.6636 27.6642 21.2343 4.9688 33.6302 24.5154 102.1629 38.6956 2.3539 6.3318 7.1113 12.9670 4.7120 15.5356 18.6324 19.5787 2.7859 75.6206 77.4262 536.1526 108.4272 35.3189 4.9762 5.4312 32.3886 75.9004 182.5815 17.6938 13.0879 21.2591 65.8609 191.9679 44.1605 17.6847 41.0348 22.8258 34.6142 132.6623 50.9222 6.0822 21.9537 18.9110 2.3404 21.8612 25.0903 2.8945 1.0147 15.2953 8.0056 65.5065 11.0862 8.2999 13.2102 27.5088 11.8578 17.9796 74.4272 206.9649 44.4535 42.7581 314.3645 978.6184 71.6673 32.1199 20.3166 4.8070 60.3899 39.9405 6.7450 14.8146 105.6039 0.2487 8.0102 1.6164 5.6310 20.6656 32.1495
temp: 298.150 k
press: 1.00000 atm
elementType: 8 8 8 7 7 7 7 6 6 6 6 6 6 6 1 1 1 1 1 1 1 1 1 1 1 1 1 1 1 1
symmnumber: 1
zpe: 654066.4 jmol-1
zpe.correction: 0.249121 hartree
zpe.thermalcorrener: 0.264477 hartree
zpe.thermalcorrenthalpy: 0.265421 hartree
zpe.thermalcorrgfe: 0.208153 hartree
zpe.sumelectzpe: -719.889324 hartree
zpe.sumelectthermal: -719.873968 hartree
zpe.sumelectthermalent: -719.873024 hartree
zpe.sumelectthermalfe: -719.930292 hartree
dipole: -3.7218 -0.5566 -0.0513
dipole: 3.7636
quadrupole: -87.8835 -83.6914 -77.4457
quadrupole: -0.4805 -1.0219 -1.0724
quadrupole: -4.8767 -0.6845 5.5612 -0.4805 -1.0219 -1.0724
hfenergy: -720.1384452 hartree
pointgroup: C01 [X(C7H16N4O3)]
dipole: 1.362059 -0.5557375 -0.1685779 debye
polarizability: 113.0845529|-2.6164071|125.8216195|-4.4534051|-5.2979723|104.3841981 unknown
InChI: InChI=1S/C7H16N4O3/c8-5(6(13)14)3-4(12)1-2-11-7(9)10/h4-5,12-13H,1-3,8-10H2
charge 0 multiplicity 1
30 atoms
O  -1.40507 2.550679 -0.94055
O  -0.495374 -1.439724 -1.212714
O  -0.432937 -2.198818 0.979893
N  -2.853266 -0.672495 1.506535
N  2.339745 0.507147 -0.536636
N  2.171955 -1.712144 -1.29741
N  2.335724 -1.379826 1.035729
C  -0.382768 1.63833 -0.364012
C  -1.102174 0.952009 0.812454
C  0.887441 2.436302 0.018649
C  -1.930336 -0.316668 0.417322
C  2.073529 1.543727 0.480959
C  -0.915146 -1.430085 0.096187
C  2.316943 -0.760999 -0.220214
H  -0.095115 0.889897 -1.126956
H  -0.387447 0.675834 1.612906
H  -1.82375 1.670728 1.239729
H  0.648497 3.172753 0.811039
H  1.215341 3.004744 -0.874867
H  -2.509154 -0.075002 -0.490006
H  1.837641 1.130419 1.490969
H  2.969158 2.183984 0.596862
H  -1.067718 2.898303 -1.805143
H  -2.354712 -1.034139 2.329684
H  -3.589663 -1.32492 1.214317
H  0.467076 -1.837041 -1.310387
H  2.336237 -1.255493 -2.203678
H  2.6993 -2.584387 -1.173285
H  1.660407 -2.139001 1.195512
H  2.524436 -0.786614 1.842813
